{"text_format":"1","workbook":"xlsx","n_sheets":3,"sheets":["Input","List","Export"],"not_rendered":{"charts":0,"images":1,"macros":1,"external_links":0,"defined_names":0,"comments":0,"pivot_tables":0},"unopened":[],"bounds":{"document_bytes":16777216,"sheet_cells":100000,"rows_first":2000,"rows_last":500,"rows_between":2000,"halvings":0,"cell_chars":16384,"cell_head_chars":4096},"cells_cut":0,"cells_raw":0,"read":"whole","date_system":"1900"}

{"sheet":"Input","index":0,"n_rows":305,"n_cols":5,"rows_kept":305,"cut":false,"hidden":false,"merged":[]}
[]
["Gateway UID"]
[]
["Gateway\nRF kanal",null,"IP Adress:…………………………………………………………………..\n\nNettverksmaske:……………………………………………………….\n\nDefault  Gateway:……………………………………………………...\n"]
["NKey"]
["SecurityLevel"]
["Node\nNr.","Adresse","Kundetekst","ML","LL"]
[1]
[2,""]
[3,""]
[4]
[5]
[6]
[7]
[8]
[9]
[10]
[11]
[12]
[13]
[14]
[15]
[16]
[17]
[18]
[19]
[20]
[21]
[22]
[23]
[24]
[25]
[26]
[27]
[28]
[29]
[30]
[]
["Gateway UID",""]
[]
["Gateway\nRF kanal",""]
["NKey",""]
["SecurityLevel",""]
["Node\nNr.","Adresse","Kundetekst","ML","LL"]
[31]
[32]
[33]
[34]
[35]
[36]
[37]
[38]
[39]
[40]
[41,""]
[42]
[43]
[44]
[45]
[46]
[47]
[48]
[49]
[50]
[51,""]
[52]
[53]
[54]
[55]
[56]
[57]
[58]
[59]
[60]
[61]
[62]
[63]
[]
["Gateway UID",""]
["Gateway\nRF kanal",""]
["NKey",""]
["SecurityLevel",""]
["Node\nNr.","Adresse","Kundetekst","ML","LL"]
[64]
[65]
[66]
[67]
[68]
[69]
[70]
[71]
[72]
[73]
[74]
[75]
[76]
[77]
[78]
[79]
[80]
[81]
[82]
[83]
[84,""]
[85]
[86]
[87]
[88]
[89]
[90]
[91]
[92]
[93]
[94]
[95]
[96]
[97]
[]
["Gateway UID",""]
[]
["Gateway\nRF kanal",""]
["NKey",""]
["SecurityLevel",""]
["Node\nNr.","Adresse","Kundetekst","ML","LL"]
[98]
[99]
[100]
[101]
[102]
[103]
[104]
[105]
[106]
[107]
[108]
[109]
[110]
[111]
[112]
[113]
[114]
[115]
[116]
[117]
[118,""]
[119]
[120]
[121]
[122]
[123]
[124]
[125]
[126]
[127]
[128]
[129]
[130]
[]
["Gateway UID",""]
[]
["Gateway\nRF kanal",""]
["NKey",""]
["SecurityLevel",""]
["Node\nNr.","Adresse","Kundetekst","ML","LL"]
[131]
[132]
[133]
[134]
[135]
[136]
[137]
[138]
[139]
[140]
[141]
[142]
[143]
[144]
[145]
[146]
[147]
[148]
[149]
[150]
[151,""]
[152]
[153]
[154]
[155]
[156]
[157]
[158]
[159]
[160]
[161]
[162]
[163]
[]
["Gateway UID",""]
[]
["Gateway\nRF kanal",""]
["NKey",""]
["SecurityLevel",""]
["Node\nNr.","Adresse","Kundetekst","ML","LL"]
[164]
[165]
[166]
[167]
[168]
[169]
[170]
[171]
[172]
[173]
[174]
[175]
[176]
[177]
[178]
[179]
[180]
[181]
[182]
[183]
[184,""]
[185]
[186]
[187]
[188]
[189]
[190]
[191]
[192]
[193]
[194]
[195]
[196]
[]
["Gateway UID",""]
[]
["Gateway\nRF kanal",""]
["NKey",""]
["SecurityLevel",""]
["Node\nNr.","Adresse","Kundetekst","ML","LL"]
[197]
[198]
[199]
[200]
[201]
[202]
[203]
[204]
[205]
[206]
[207]
[208]
[209]
[210]
[211]
[212]
[213]
[214]
[215]
[216]
[217,""]
[218]
[219]
[220]
[221]
[222]
[223]
[224]
[225]
[226]
[227]
[228]
[229]
[]
["Gateway UID",""]
[]
["Gateway\nRF kanal",""]
["NKey"]
["SecurityLevel",""]
["Node\nNr.","Adresse","Kundetekst","ML","LL"]
[230]
[231]
[232]
[233]
[234]
[235]
[236]
[237]
[238]
[239]
[240]
[241]
[242]
[243]
[244]
[245]
[246]
[247]
[248]
[249]
[250,""]

{"sheet":"List","index":1,"n_rows":13,"n_cols":4,"rows_kept":13,"cut":false,"hidden":true,"merged":[]}
[]
[2,null,null,"Enc"]
[3,null,null,"Enc_RAP"]
[4]
[5]
[8]
[9]
[10]
[11]
[13]
[15]
[17]
[18]

{"sheet":"Export","index":2,"n_rows":251,"n_cols":3,"rows_kept":251,"cut":false,"hidden":false,"merged":[]}
["Node\nNr.","Adresse","Kundetekst"]
[{"$f":"Input!A8","v":1},{"$f":"IF(Input!B8<>\"\",Input!B8,\"\")","v":""},{"$f":"IF(Input!C8<>\"\",Input!C8,\"\")","v":""}]
[{"$f":"Input!A9","v":2},{"$f":"IF(Input!B9<>\"\",Input!B9,\"\")","v":""},{"$f":"IF(Input!C9<>\"\",Input!C9,\"\")","v":""}]
[{"$f":"Input!A10","v":3},{"$f":"IF(Input!B10<>\"\",Input!B10,\"\")","v":""},{"$f":"IF(Input!C10<>\"\",Input!C10,\"\")","v":""}]
[{"$f":"Input!A11","v":4},{"$f":"IF(Input!B11<>\"\",Input!B11,\"\")","v":""},{"$f":"IF(Input!C11<>\"\",Input!C11,\"\")","v":""}]
[{"$f":"Input!A12","v":5},{"$f":"IF(Input!B12<>\"\",Input!B12,\"\")","v":""},{"$f":"IF(Input!C12<>\"\",Input!C12,\"\")","v":""}]
[{"$f":"Input!A13","v":6},{"$f":"IF(Input!B13<>\"\",Input!B13,\"\")","v":""},{"$f":"IF(Input!C13<>\"\",Input!C13,\"\")","v":""}]
[{"$f":"Input!A14","v":7},{"$f":"IF(Input!B14<>\"\",Input!B14,\"\")","v":""},{"$f":"IF(Input!C14<>\"\",Input!C14,\"\")","v":""}]
[{"$f":"Input!A15","v":8},{"$f":"IF(Input!B15<>\"\",Input!B15,\"\")","v":""},{"$f":"IF(Input!C15<>\"\",Input!C15,\"\")","v":""}]
[{"$f":"Input!A16","v":9},{"$f":"IF(Input!B16<>\"\",Input!B16,\"\")","v":""},{"$f":"IF(Input!C16<>\"\",Input!C16,\"\")","v":""}]
[{"$f":"Input!A17","v":10},{"$f":"IF(Input!B17<>\"\",Input!B17,\"\")","v":""},{"$f":"IF(Input!C17<>\"\",Input!C17,\"\")","v":""}]
[{"$f":"Input!A18","v":11},{"$f":"IF(Input!B18<>\"\",Input!B18,\"\")","v":""},{"$f":"IF(Input!C18<>\"\",Input!C18,\"\")","v":""}]
[{"$f":"Input!A19","v":12},{"$f":"IF(Input!B19<>\"\",Input!B19,\"\")","v":""},{"$f":"IF(Input!C19<>\"\",Input!C19,\"\")","v":""}]
[{"$f":"Input!A20","v":13},{"$f":"IF(Input!B20<>\"\",Input!B20,\"\")","v":""},{"$f":"IF(Input!C20<>\"\",Input!C20,\"\")","v":""}]
[{"$f":"Input!A21","v":14},{"$f":"IF(Input!B21<>\"\",Input!B21,\"\")","v":""},{"$f":"IF(Input!C21<>\"\",Input!C21,\"\")","v":""}]
[{"$f":"Input!A22","v":15},{"$f":"IF(Input!B22<>\"\",Input!B22,\"\")","v":""},{"$f":"IF(Input!C22<>\"\",Input!C22,\"\")","v":""}]
[{"$f":"Input!A23","v":16},{"$f":"IF(Input!B23<>\"\",Input!B23,\"\")","v":""},{"$f":"IF(Input!C23<>\"\",Input!C23,\"\")","v":""}]
[{"$f":"Input!A24","v":17},{"$f":"IF(Input!B24<>\"\",Input!B24,\"\")","v":""},{"$f":"IF(Input!C24<>\"\",Input!C24,\"\")","v":""}]
[{"$f":"Input!A25","v":18},{"$f":"IF(Input!B25<>\"\",Input!B25,\"\")","v":""},{"$f":"IF(Input!C25<>\"\",Input!C25,\"\")","v":""}]
[{"$f":"Input!A26","v":19},{"$f":"IF(Input!B26<>\"\",Input!B26,\"\")","v":""},{"$f":"IF(Input!C26<>\"\",Input!C26,\"\")","v":""}]
[{"$f":"Input!A27","v":20},{"$f":"IF(Input!B27<>\"\",Input!B27,\"\")","v":""},{"$f":"IF(Input!C27<>\"\",Input!C27,\"\")","v":""}]
[{"$f":"Input!A28","v":21},{"$f":"IF(Input!B28<>\"\",Input!B28,\"\")","v":""},{"$f":"IF(Input!C28<>\"\",Input!C28,\"\")","v":""}]
[{"$f":"Input!A29","v":22},{"$f":"IF(Input!B29<>\"\",Input!B29,\"\")","v":""},{"$f":"IF(Input!C29<>\"\",Input!C29,\"\")","v":""}]
[{"$f":"Input!A30","v":23},{"$f":"IF(Input!B30<>\"\",Input!B30,\"\")","v":""},{"$f":"IF(Input!C30<>\"\",Input!C30,\"\")","v":""}]
[{"$f":"Input!A31","v":24},{"$f":"IF(Input!B31<>\"\",Input!B31,\"\")","v":""},{"$f":"IF(Input!C31<>\"\",Input!C31,\"\")","v":""}]
[{"$f":"Input!A32","v":25},{"$f":"IF(Input!B32<>\"\",Input!B32,\"\")","v":""},{"$f":"IF(Input!C32<>\"\",Input!C32,\"\")","v":""}]
[{"$f":"Input!A33","v":26},{"$f":"IF(Input!B33<>\"\",Input!B33,\"\")","v":""},{"$f":"IF(Input!C33<>\"\",Input!C33,\"\")","v":""}]
[{"$f":"Input!A34","v":27},{"$f":"IF(Input!B34<>\"\",Input!B34,\"\")","v":""},{"$f":"IF(Input!C34<>\"\",Input!C34,\"\")","v":""}]
[{"$f":"Input!A35","v":28},{"$f":"IF(Input!B35<>\"\",Input!B35,\"\")","v":""},{"$f":"IF(Input!C35<>\"\",Input!C35,\"\")","v":""}]
[{"$f":"Input!A36","v":29},{"$f":"IF(Input!B36<>\"\",Input!B36,\"\")","v":""},{"$f":"IF(Input!C36<>\"\",Input!C36,\"\")","v":""}]
[{"$f":"Input!A37","v":30},{"$f":"IF(Input!B37<>\"\",Input!B37,\"\")","v":""},{"$f":"IF(Input!C37<>\"\",Input!C37,\"\")","v":""}]
[{"$f":"Input!A45","v":31},{"$f":"IF(Input!B45<>\"\",Input!B45,\"\")","v":""},{"$f":"IF(Input!C45<>\"\",Input!C45,\"\")","v":""}]
[{"$f":"Input!A46","v":32},{"$f":"IF(Input!B46<>\"\",Input!B46,\"\")","v":""},{"$f":"IF(Input!C46<>\"\",Input!C46,\"\")","v":""}]
[{"$f":"Input!A47","v":33},{"$f":"IF(Input!B47<>\"\",Input!B47,\"\")","v":""},{"$f":"IF(Input!C47<>\"\",Input!C47,\"\")","v":""}]
[{"$f":"Input!A48","v":34},{"$f":"IF(Input!B48<>\"\",Input!B48,\"\")","v":""},{"$f":"IF(Input!C48<>\"\",Input!C48,\"\")","v":""}]
[{"$f":"Input!A49","v":35},{"$f":"IF(Input!B49<>\"\",Input!B49,\"\")","v":""},{"$f":"IF(Input!C49<>\"\",Input!C49,\"\")","v":""}]
[{"$f":"Input!A50","v":36},{"$f":"IF(Input!B50<>\"\",Input!B50,\"\")","v":""},{"$f":"IF(Input!C50<>\"\",Input!C50,\"\")","v":""}]
[{"$f":"Input!A51","v":37},{"$f":"IF(Input!B51<>\"\",Input!B51,\"\")","v":""},{"$f":"IF(Input!C51<>\"\",Input!C51,\"\")","v":""}]
[{"$f":"Input!A52","v":38},{"$f":"IF(Input!B52<>\"\",Input!B52,\"\")","v":""},{"$f":"IF(Input!C52<>\"\",Input!C52,\"\")","v":""}]
[{"$f":"Input!A53","v":39},{"$f":"IF(Input!B53<>\"\",Input!B53,\"\")","v":""},{"$f":"IF(Input!C53<>\"\",Input!C53,\"\")","v":""}]
[{"$f":"Input!A54","v":40},{"$f":"IF(Input!B54<>\"\",Input!B54,\"\")","v":""},{"$f":"IF(Input!C54<>\"\",Input!C54,\"\")","v":""}]
[{"$f":"Input!A55","v":41},{"$f":"IF(Input!B55<>\"\",Input!B55,\"\")","v":""},{"$f":"IF(Input!C55<>\"\",Input!C55,\"\")","v":""}]
[{"$f":"Input!A56","v":42},{"$f":"IF(Input!B56<>\"\",Input!B56,\"\")","v":""},{"$f":"IF(Input!C56<>\"\",Input!C56,\"\")","v":""}]
[{"$f":"Input!A57","v":43},{"$f":"IF(Input!B57<>\"\",Input!B57,\"\")","v":""},{"$f":"IF(Input!C57<>\"\",Input!C57,\"\")","v":""}]
[{"$f":"Input!A58","v":44},{"$f":"IF(Input!B58<>\"\",Input!B58,\"\")","v":""},{"$f":"IF(Input!C58<>\"\",Input!C58,\"\")","v":""}]
[{"$f":"Input!A59","v":45},{"$f":"IF(Input!B59<>\"\",Input!B59,\"\")","v":""},{"$f":"IF(Input!C59<>\"\",Input!C59,\"\")","v":""}]
[{"$f":"Input!A60","v":46},{"$f":"IF(Input!B60<>\"\",Input!B60,\"\")","v":""},{"$f":"IF(Input!C60<>\"\",Input!C60,\"\")","v":""}]
[{"$f":"Input!A61","v":47},{"$f":"IF(Input!B61<>\"\",Input!B61,\"\")","v":""},{"$f":"IF(Input!C61<>\"\",Input!C61,\"\")","v":""}]
[{"$f":"Input!A62","v":48},{"$f":"IF(Input!B62<>\"\",Input!B62,\"\")","v":""},{"$f":"IF(Input!C62<>\"\",Input!C62,\"\")","v":""}]
[{"$f":"Input!A63","v":49},{"$f":"IF(Input!B63<>\"\",Input!B63,\"\")","v":""},{"$f":"IF(Input!C63<>\"\",Input!C63,\"\")","v":""}]
[{"$f":"Input!A64","v":50},{"$f":"IF(Input!B64<>\"\",Input!B64,\"\")","v":""},{"$f":"IF(Input!C64<>\"\",Input!C64,\"\")","v":""}]
[{"$f":"Input!A65","v":51},{"$f":"IF(Input!B65<>\"\",Input!B65,\"\")","v":""},{"$f":"IF(Input!C65<>\"\",Input!C65,\"\")","v":""}]
[{"$f":"Input!A66","v":52},{"$f":"IF(Input!B66<>\"\",Input!B66,\"\")","v":""},{"$f":"IF(Input!C66<>\"\",Input!C66,\"\")","v":""}]
[{"$f":"Input!A67","v":53},{"$f":"IF(Input!B67<>\"\",Input!B67,\"\")","v":""},{"$f":"IF(Input!C67<>\"\",Input!C67,\"\")","v":""}]
[{"$f":"Input!A68","v":54},{"$f":"IF(Input!B68<>\"\",Input!B68,\"\")","v":""},{"$f":"IF(Input!C68<>\"\",Input!C68,\"\")","v":""}]
[{"$f":"Input!A69","v":55},{"$f":"IF(Input!B69<>\"\",Input!B69,\"\")","v":""},{"$f":"IF(Input!C69<>\"\",Input!C69,\"\")","v":""}]
[{"$f":"Input!A70","v":56},{"$f":"IF(Input!B70<>\"\",Input!B70,\"\")","v":""},{"$f":"IF(Input!C70<>\"\",Input!C70,\"\")","v":""}]
[{"$f":"Input!A71","v":57},{"$f":"IF(Input!B71<>\"\",Input!B71,\"\")","v":""},{"$f":"IF(Input!C71<>\"\",Input!C71,\"\")","v":""}]
[{"$f":"Input!A72","v":58},{"$f":"IF(Input!B72<>\"\",Input!B72,\"\")","v":""},{"$f":"IF(Input!C72<>\"\",Input!C72,\"\")","v":""}]
[{"$f":"Input!A73","v":59},{"$f":"IF(Input!B73<>\"\",Input!B73,\"\")","v":""},{"$f":"IF(Input!C73<>\"\",Input!C73,\"\")","v":""}]
[{"$f":"Input!A74","v":60},{"$f":"IF(Input!B74<>\"\",Input!B74,\"\")","v":""},{"$f":"IF(Input!C74<>\"\",Input!C74,\"\")","v":""}]
[{"$f":"Input!A75","v":61},{"$f":"IF(Input!B75<>\"\",Input!B75,\"\")","v":""}]
[{"$f":"Input!A76","v":62},{"$f":"IF(Input!B76<>\"\",Input!B76,\"\")","v":""}]
[{"$f":"Input!A77","v":63},{"$f":"IF(Input!B77<>\"\",Input!B77,\"\")","v":""}]
[64,{"$f":"IF(Input!B85<>\"\",Input!B85,\"\")","v":""}]
[65,{"$f":"IF(Input!B86<>\"\",Input!B86,\"\")","v":""}]
[66,{"$f":"IF(Input!B87<>\"\",Input!B87,\"\")","v":""}]
[67,{"$f":"IF(Input!B88<>\"\",Input!B88,\"\")","v":""}]
[68,{"$f":"IF(Input!B89<>\"\",Input!B89,\"\")","v":""}]
[69,{"$f":"IF(Input!B90<>\"\",Input!B90,\"\")","v":""}]
[70,{"$f":"IF(Input!B91<>\"\",Input!B91,\"\")","v":""}]
[71,{"$f":"IF(Input!B92<>\"\",Input!B92,\"\")","v":""}]
[72,{"$f":"IF(Input!B93<>\"\",Input!B93,\"\")","v":""}]
[73,{"$f":"IF(Input!B94<>\"\",Input!B94,\"\")","v":""}]
[74,{"$f":"IF(Input!B95<>\"\",Input!B95,\"\")","v":""}]
[75,{"$f":"IF(Input!B96<>\"\",Input!B96,\"\")","v":""}]
[76,{"$f":"IF(Input!B97<>\"\",Input!B97,\"\")","v":""}]
[77,{"$f":"IF(Input!B98<>\"\",Input!B98,\"\")","v":""}]
[78,{"$f":"IF(Input!B99<>\"\",Input!B99,\"\")","v":""}]
[79,{"$f":"IF(Input!B100<>\"\",Input!B100,\"\")","v":""}]
[80,{"$f":"IF(Input!B101<>\"\",Input!B101,\"\")","v":""}]
[81,{"$f":"IF(Input!B102<>\"\",Input!B102,\"\")","v":""}]
[82,{"$f":"IF(Input!B103<>\"\",Input!B103,\"\")","v":""}]
[83,{"$f":"IF(Input!B104<>\"\",Input!B104,\"\")","v":""}]
[84,{"$f":"IF(Input!B105<>\"\",Input!B105,\"\")","v":""}]
[85,{"$f":"IF(Input!B106<>\"\",Input!B106,\"\")","v":""}]
[86,{"$f":"IF(Input!B107<>\"\",Input!B107,\"\")","v":""}]
[87,{"$f":"IF(Input!B108<>\"\",Input!B108,\"\")","v":""}]
[88,{"$f":"IF(Input!B109<>\"\",Input!B109,\"\")","v":""}]
[89,{"$f":"IF(Input!B110<>\"\",Input!B110,\"\")","v":""}]
[90,{"$f":"IF(Input!B111<>\"\",Input!B111,\"\")","v":""}]
[91,{"$f":"IF(Input!B112<>\"\",Input!B112,\"\")","v":""}]
[92,{"$f":"IF(Input!B113<>\"\",Input!B113,\"\")","v":""}]
[93,{"$f":"IF(Input!B114<>\"\",Input!B114,\"\")","v":""}]
[94,{"$f":"IF(Input!B115<>\"\",Input!B115,\"\")","v":""}]
[95,{"$f":"IF(Input!B116<>\"\",Input!B116,\"\")","v":""}]
[96,{"$f":"IF(Input!B117<>\"\",Input!B117,\"\")","v":""}]
[97,{"$f":"IF(Input!B118<>\"\",Input!B118,\"\")","v":""}]
[98,{"$f":"IF(Input!B125<>\"\",Input!B125,\"\")","v":""}]
[99,{"$f":"IF(Input!B126<>\"\",Input!B126,\"\")","v":""}]
[100,{"$f":"IF(Input!B127<>\"\",Input!B127,\"\")","v":""}]
[101,{"$f":"IF(Input!B128<>\"\",Input!B128,\"\")","v":""}]
[102,{"$f":"IF(Input!B129<>\"\",Input!B129,\"\")","v":""}]
[103,{"$f":"IF(Input!B130<>\"\",Input!B130,\"\")","v":""}]
[104,{"$f":"IF(Input!B131<>\"\",Input!B131,\"\")","v":""}]
[105,{"$f":"IF(Input!B132<>\"\",Input!B132,\"\")","v":""}]
[106,{"$f":"IF(Input!B133<>\"\",Input!B133,\"\")","v":""}]
[107,{"$f":"IF(Input!B134<>\"\",Input!B134,\"\")","v":""}]
[108,{"$f":"IF(Input!B135<>\"\",Input!B135,\"\")","v":""}]
[109,{"$f":"IF(Input!B136<>\"\",Input!B136,\"\")","v":""}]
[110,{"$f":"IF(Input!B137<>\"\",Input!B137,\"\")","v":""}]
[111,{"$f":"IF(Input!B138<>\"\",Input!B138,\"\")","v":""}]
[112,{"$f":"IF(Input!B139<>\"\",Input!B139,\"\")","v":""}]
[113,{"$f":"IF(Input!B140<>\"\",Input!B140,\"\")","v":""}]
[114,{"$f":"IF(Input!B141<>\"\",Input!B141,\"\")","v":""}]
[115,{"$f":"IF(Input!B142<>\"\",Input!B142,\"\")","v":""}]
[116,{"$f":"IF(Input!B143<>\"\",Input!B143,\"\")","v":""}]
[117,{"$f":"IF(Input!B144<>\"\",Input!B144,\"\")","v":""}]
[118,{"$f":"IF(Input!B145<>\"\",Input!B145,\"\")","v":""}]
[119,{"$f":"IF(Input!B146<>\"\",Input!B146,\"\")","v":""}]
[120,{"$f":"IF(Input!B147<>\"\",Input!B147,\"\")","v":""}]
[121,{"$f":"IF(Input!B148<>\"\",Input!B148,\"\")","v":""}]
[122,{"$f":"IF(Input!B149<>\"\",Input!B149,\"\")","v":""}]
[123,{"$f":"IF(Input!B150<>\"\",Input!B150,\"\")","v":""}]
[124,{"$f":"IF(Input!B151<>\"\",Input!B151,\"\")","v":""}]
[125,{"$f":"IF(Input!B152<>\"\",Input!B152,\"\")","v":""}]
[126,{"$f":"IF(Input!B153<>\"\",Input!B153,\"\")","v":""}]
[127,{"$f":"IF(Input!B154<>\"\",Input!B154,\"\")","v":""}]
[128,{"$f":"IF(Input!B155<>\"\",Input!B155,\"\")","v":""}]
[129,{"$f":"IF(Input!B156<>\"\",Input!B156,\"\")","v":""}]
[130,{"$f":"IF(Input!B157<>\"\",Input!B157,\"\")","v":""}]
[131,{"$f":"IF(Input!B165<>\"\",Input!B165,\"\")","v":""}]
[132,{"$f":"IF(Input!B166<>\"\",Input!B166,\"\")","v":""}]
[133,{"$f":"IF(Input!B167<>\"\",Input!B167,\"\")","v":""}]
[134,{"$f":"IF(Input!B168<>\"\",Input!B168,\"\")","v":""}]
[135,{"$f":"IF(Input!B169<>\"\",Input!B169,\"\")","v":""}]
[136,{"$f":"IF(Input!B170<>\"\",Input!B170,\"\")","v":""}]
[137,{"$f":"IF(Input!B171<>\"\",Input!B171,\"\")","v":""}]
[138,{"$f":"IF(Input!B172<>\"\",Input!B172,\"\")","v":""}]
[139,{"$f":"IF(Input!B173<>\"\",Input!B173,\"\")","v":""}]
[140,{"$f":"IF(Input!B174<>\"\",Input!B174,\"\")","v":""}]
[141,{"$f":"IF(Input!B175<>\"\",Input!B175,\"\")","v":""}]
[142,{"$f":"IF(Input!B176<>\"\",Input!B176,\"\")","v":""}]
[143,{"$f":"IF(Input!B177<>\"\",Input!B177,\"\")","v":""}]
[144,{"$f":"IF(Input!B178<>\"\",Input!B178,\"\")","v":""}]
[145,{"$f":"IF(Input!B179<>\"\",Input!B179,\"\")","v":""}]
[146,{"$f":"IF(Input!B180<>\"\",Input!B180,\"\")","v":""}]
[147,{"$f":"IF(Input!B181<>\"\",Input!B181,\"\")","v":""}]
[148,{"$f":"IF(Input!B182<>\"\",Input!B182,\"\")","v":""}]
[149,{"$f":"IF(Input!B183<>\"\",Input!B183,\"\")","v":""}]
[150,{"$f":"IF(Input!B184<>\"\",Input!B184,\"\")","v":""}]
[151,{"$f":"IF(Input!B185<>\"\",Input!B185,\"\")","v":""}]
[152,{"$f":"IF(Input!B186<>\"\",Input!B186,\"\")","v":""}]
[153,{"$f":"IF(Input!B187<>\"\",Input!B187,\"\")","v":""}]
[154,{"$f":"IF(Input!B188<>\"\",Input!B188,\"\")","v":""}]
[155,{"$f":"IF(Input!B189<>\"\",Input!B189,\"\")","v":""}]
[156,{"$f":"IF(Input!B190<>\"\",Input!B190,\"\")","v":""}]
[157,{"$f":"IF(Input!B191<>\"\",Input!B191,\"\")","v":""}]
[158,{"$f":"IF(Input!B192<>\"\",Input!B192,\"\")","v":""}]
[159,{"$f":"IF(Input!B193<>\"\",Input!B193,\"\")","v":""}]
[160,{"$f":"IF(Input!B194<>\"\",Input!B194,\"\")","v":""}]
[161,{"$f":"IF(Input!B195<>\"\",Input!B195,\"\")","v":""}]
[162,{"$f":"IF(Input!B196<>\"\",Input!B196,\"\")","v":""}]
[163,{"$f":"IF(Input!B197<>\"\",Input!B197,\"\")","v":""}]
[164,{"$f":"IF(Input!B205<>\"\",Input!B205,\"\")","v":""}]
[165,{"$f":"IF(Input!B206<>\"\",Input!B206,\"\")","v":""}]
[166,{"$f":"IF(Input!B207<>\"\",Input!B207,\"\")","v":""}]
[167,{"$f":"IF(Input!B208<>\"\",Input!B208,\"\")","v":""}]
[168,{"$f":"IF(Input!B209<>\"\",Input!B209,\"\")","v":""}]
[169,{"$f":"IF(Input!B210<>\"\",Input!B210,\"\")","v":""}]
[170,{"$f":"IF(Input!B211<>\"\",Input!B211,\"\")","v":""}]
[171,{"$f":"IF(Input!B212<>\"\",Input!B212,\"\")","v":""}]
[172,{"$f":"IF(Input!B213<>\"\",Input!B213,\"\")","v":""}]
[173,{"$f":"IF(Input!B214<>\"\",Input!B214,\"\")","v":""}]
[174,{"$f":"IF(Input!B215<>\"\",Input!B215,\"\")","v":""}]
[175,{"$f":"IF(Input!B216<>\"\",Input!B216,\"\")","v":""}]
[176,{"$f":"IF(Input!B217<>\"\",Input!B217,\"\")","v":""}]
[177,{"$f":"IF(Input!B218<>\"\",Input!B218,\"\")","v":""}]
[178,{"$f":"IF(Input!B219<>\"\",Input!B219,\"\")","v":""}]
[179,{"$f":"IF(Input!B220<>\"\",Input!B220,\"\")","v":""}]
[180,{"$f":"IF(Input!B221<>\"\",Input!B221,\"\")","v":""}]
[181,{"$f":"IF(Input!B222<>\"\",Input!B222,\"\")","v":""}]
[182,{"$f":"IF(Input!B223<>\"\",Input!B223,\"\")","v":""}]
[183,{"$f":"IF(Input!B224<>\"\",Input!B224,\"\")","v":""}]
[184,{"$f":"IF(Input!B225<>\"\",Input!B225,\"\")","v":""}]
[185,{"$f":"IF(Input!B226<>\"\",Input!B226,\"\")","v":""}]
[186,{"$f":"IF(Input!B227<>\"\",Input!B227,\"\")","v":""}]
[187,{"$f":"IF(Input!B228<>\"\",Input!B228,\"\")","v":""}]
[188,{"$f":"IF(Input!B229<>\"\",Input!B229,\"\")","v":""}]
[189,{"$f":"IF(Input!B230<>\"\",Input!B230,\"\")","v":""}]
[190,{"$f":"IF(Input!B231<>\"\",Input!B231,\"\")","v":""}]
[191,{"$f":"IF(Input!B232<>\"\",Input!B232,\"\")","v":""}]
[192,{"$f":"IF(Input!B233<>\"\",Input!B233,\"\")","v":""}]
[193,{"$f":"IF(Input!B234<>\"\",Input!B234,\"\")","v":""}]
[194,{"$f":"IF(Input!B235<>\"\",Input!B235,\"\")","v":""}]
[195,{"$f":"IF(Input!B236<>\"\",Input!B236,\"\")","v":""}]
[196,{"$f":"IF(Input!B237<>\"\",Input!B237,\"\")","v":""}]
[197,{"$f":"IF(Input!B245<>\"\",Input!B245,\"\")","v":""}]
[198,{"$f":"IF(Input!B246<>\"\",Input!B246,\"\")","v":""}]
[199,{"$f":"IF(Input!B247<>\"\",Input!B247,\"\")","v":""}]
[200,{"$f":"IF(Input!B248<>\"\",Input!B248,\"\")","v":""}]
[201,{"$f":"IF(Input!B249<>\"\",Input!B249,\"\")","v":""}]
[202,{"$f":"IF(Input!B250<>\"\",Input!B250,\"\")","v":""}]
[203,{"$f":"IF(Input!B251<>\"\",Input!B251,\"\")","v":""}]
[204,{"$f":"IF(Input!B252<>\"\",Input!B252,\"\")","v":""}]
[205,{"$f":"IF(Input!B253<>\"\",Input!B253,\"\")","v":""}]
[206,{"$f":"IF(Input!B254<>\"\",Input!B254,\"\")","v":""}]
[207,{"$f":"IF(Input!B255<>\"\",Input!B255,\"\")","v":""}]
[208,{"$f":"IF(Input!B256<>\"\",Input!B256,\"\")","v":""}]
[209,{"$f":"IF(Input!B257<>\"\",Input!B257,\"\")","v":""}]
[210,{"$f":"IF(Input!B258<>\"\",Input!B258,\"\")","v":""}]
[211,{"$f":"IF(Input!B259<>\"\",Input!B259,\"\")","v":""}]
[212,{"$f":"IF(Input!B260<>\"\",Input!B260,\"\")","v":""}]
[213,{"$f":"IF(Input!B261<>\"\",Input!B261,\"\")","v":""}]
[214,{"$f":"IF(Input!B262<>\"\",Input!B262,\"\")","v":""}]
[215,{"$f":"IF(Input!B263<>\"\",Input!B263,\"\")","v":""}]
[216,{"$f":"IF(Input!B264<>\"\",Input!B264,\"\")","v":""}]
[217,{"$f":"IF(Input!B265<>\"\",Input!B265,\"\")","v":""}]
[218,{"$f":"IF(Input!B266<>\"\",Input!B266,\"\")","v":""}]
[219,{"$f":"IF(Input!B267<>\"\",Input!B267,\"\")","v":""}]
[220,{"$f":"IF(Input!B268<>\"\",Input!B268,\"\")","v":""}]
[221,{"$f":"IF(Input!B269<>\"\",Input!B269,\"\")","v":""}]
[222,{"$f":"IF(Input!B270<>\"\",Input!B270,\"\")","v":""}]
[223,{"$f":"IF(Input!B271<>\"\",Input!B271,\"\")","v":""}]
[224,{"$f":"IF(Input!B272<>\"\",Input!B272,\"\")","v":""}]
[225,{"$f":"IF(Input!B273<>\"\",Input!B273,\"\")","v":""}]
[226,{"$f":"IF(Input!B274<>\"\",Input!B274,\"\")","v":""}]
[227,{"$f":"IF(Input!B275<>\"\",Input!B275,\"\")","v":""}]
[228,{"$f":"IF(Input!B276<>\"\",Input!B276,\"\")","v":""}]
[229,{"$f":"IF(Input!B277<>\"\",Input!B277,\"\")","v":""}]
[230,{"$f":"IF(Input!B285<>\"\",Input!B285,\"\")","v":""}]
[231,{"$f":"IF(Input!B286<>\"\",Input!B286,\"\")","v":""}]
[232,{"$f":"IF(Input!B287<>\"\",Input!B287,\"\")","v":""}]
[233,{"$f":"IF(Input!B288<>\"\",Input!B288,\"\")","v":""}]
[234,{"$f":"IF(Input!B289<>\"\",Input!B289,\"\")","v":""}]
[235,{"$f":"IF(Input!B290<>\"\",Input!B290,\"\")","v":""}]
[236,{"$f":"IF(Input!B291<>\"\",Input!B291,\"\")","v":""}]
[237,{"$f":"IF(Input!B292<>\"\",Input!B292,\"\")","v":""}]
[238,{"$f":"IF(Input!B293<>\"\",Input!B293,\"\")","v":""}]
[239,{"$f":"IF(Input!B294<>\"\",Input!B294,\"\")","v":""}]
[240,{"$f":"IF(Input!B295<>\"\",Input!B295,\"\")","v":""}]
[241,{"$f":"IF(Input!B296<>\"\",Input!B296,\"\")","v":""}]
[242,{"$f":"IF(Input!B297<>\"\",Input!B297,\"\")","v":""}]
[243,{"$f":"IF(Input!B298<>\"\",Input!B298,\"\")","v":""}]
[244,{"$f":"IF(Input!B299<>\"\",Input!B299,\"\")","v":""}]
[245,{"$f":"IF(Input!B300<>\"\",Input!B300,\"\")","v":""}]
[246,{"$f":"IF(Input!B301<>\"\",Input!B301,\"\")","v":""}]
[247,{"$f":"IF(Input!B302<>\"\",Input!B302,\"\")","v":""}]
[248,{"$f":"IF(Input!B303<>\"\",Input!B303,\"\")","v":""}]
[249,{"$f":"IF(Input!B304<>\"\",Input!B304,\"\")","v":""}]
[250,{"$f":"IF(Input!B305<>\"\",Input!B305,\"\")","v":""}]