{"text_format":"3","workbook":"xlsx","n_sheets":3,"sheets":["Input","List","Export"],"not_rendered":{"images":1,"macros":1,"defined_names":1},"read":"whole","date_system":"1900"}

{"sheet":"Input","index":0,"n_rows":306,"n_cols":5,"rows_kept":306}
[]
["Gateway SID","00000000"]
[null,"Plassering:"]
["Gateway\nRF kanal",2,"IP Adress:…………………………………………………………………..\n\nNettverksmaske:……………………………………………………….\n\nDefault  Gateway:……………………………………………………...\n"]
["NKey","12345678"]
["SecurityLevel","Enc"]
["Node\nNr.","Adresse","Kundetekst","ML","LL"]
[1]
[2]
[3]
[4]
[5]
[6]
[7]
[8]
[9]
[10]
[11]
[12]
[13]
[14]
[15]
[16]
[17]
[18]
[19]
[20]
[21]
[22]
[23]
[24]
[25]
[26,null,""]
[27]
[28]
[29]
[30]
[]
["Gateway SID",{"$f":"B2","v":"00000000"}]
[null,"Plassering:",{"$f":"C3","v":0}]
["Gateway\nRF kanal",{"$f":"B4","v":2}]
["NKey",{"$f":"B5","v":"12345678"}]
["SecurityLevel",{"$f":"B6","v":"Enc"}]
["Node\nNr.","Adresse","Kundetekst","ML","LL"]
[31]
[32]
[33]
[34]
[35]
[36]
[37]
[38]
[39]
[40,null,""]
[41]
[42]
[43]
[44]
[45]
[46]
[47]
[48]
[49]
[50]
[51]
[52]
[53]
[54]
[55]
[56,null,""]
[57]
[58]
[59]
[60]
[61]
[62]
[63]
[]
["Gateway SID",{"$f":"B2","v":"00000000"}]
[null,"Plassering:",{"$f":"C3","v":0}]
["Gateway\nRF kanal",{"$f":"B4","v":2}]
["NKey",{"$f":"B5","v":"12345678"}]
["SecurityLevel",{"$f":"B6","v":"Enc"}]
["Node\nNr.","Adresse","Kundetekst","ML","LL"]
[64]
[65]
[66]
[67]
[68]
[69]
[70]
[71]
[72]
[73]
[74]
[75]
[76]
[77]
[78]
[79]
[80]
[81]
[82]
[83]
[84]
[85]
[86]
[87]
[88]
[89]
[90]
[91]
[92]
[93]
[94]
[95]
[96]
[97]
[]
["Gateway SID",{"$f":"B2","v":"00000000"}]
[null,"Plassering:",{"$f":"C3","v":0}]
["Gateway\nRF kanal",{"$f":"B4","v":2}]
["NKey",{"$f":"B5","v":"12345678"}]
["SecurityLevel",{"$f":"B6","v":"Enc"}]
["Node\nNr.","Adresse","Kundetekst","ML","LL"]
[98]
[99]
[100]
[101]
[102]
[103]
[104]
[105]
[106]
[107]
[108]
[109]
[110]
[111]
[112]
[113]
[114]
[115]
[116]
[117]
[118]
[119]
[120]
[121]
[122]
[123]
[124]
[125]
[126]
[127]
[128]
[129]
[130]
[]
["Gateway SID",{"$f":"B2","v":"00000000"}]
[null,"Plassering:",{"$f":"C3","v":0}]
["Gateway\nRF kanal",{"$f":"B4","v":2}]
["NKey",{"$f":"B5","v":"12345678"}]
["SecurityLevel",{"$f":"B6","v":"Enc"}]
["Node\nNr.","Adresse","Kundetekst","ML","LL"]
[131]
[132]
[133]
[134]
[135]
[136]
[137]
[138]
[139]
[140]
[141]
[142]
[143]
[144]
[145]
[146]
[147]
[148]
[149]
[150]
[151]
[152]
[153]
[154]
[155]
[156]
[157]
[158]
[159]
[160]
[161]
[162]
[163]
[]
["Gateway SID",{"$f":"B2","v":"00000000"}]
{"$rows_left_out":107}
{"sheet":"List","index":1,"n_rows":6,"n_cols":4,"rows_kept":6,"hidden":true}
[]
[{"$nulls":3},"Enc"]
[2,null,null,"Enc_RAP"]
[3]
[4]
[5]

{"sheet":"Export","index":2,"n_rows":252,"n_cols":3,"rows_kept":252}
["Node\nNr.","Adresse","Kundetekst"]
[null,"HexAddress","Name"]
[{"$f":"Input!A8","v":1},{"$f":"IF(Input!B8<>\"\",Input!B8,\"\")","v":""},{"$f":"IF(Input!C8<>\"\",Input!C8,\"\")","v":""}]
[{"$f":"Input!A9","v":2},{"$f":"IF(Input!B9<>\"\",Input!B9,\"\")","v":""},{"$f":"IF(Input!C9<>\"\",Input!C9,\"\")","v":""}]
[{"$f":"Input!A10","v":3},{"$f":"IF(Input!B10<>\"\",Input!B10,\"\")","v":""},{"$f":"IF(Input!C10<>\"\",Input!C10,\"\")","v":""}]
[{"$f":"Input!A11","v":4},{"$f":"IF(Input!B11<>\"\",Input!B11,\"\")","v":""},{"$f":"IF(Input!C11<>\"\",Input!C11,\"\")","v":""}]
[{"$f":"Input!A12","v":5},{"$f":"IF(Input!B12<>\"\",Input!B12,\"\")","v":""},{"$f":"IF(Input!C12<>\"\",Input!C12,\"\")","v":""}]
[{"$f":"Input!A13","v":6},{"$f":"IF(Input!B13<>\"\",Input!B13,\"\")","v":""},{"$f":"IF(Input!C13<>\"\",Input!C13,\"\")","v":""}]
[{"$f":"Input!A14","v":7},{"$f":"IF(Input!B14<>\"\",Input!B14,\"\")","v":""},{"$f":"IF(Input!C14<>\"\",Input!C14,\"\")","v":""}]
[{"$f":"Input!A15","v":8},{"$f":"IF(Input!B15<>\"\",Input!B15,\"\")","v":""},{"$f":"IF(Input!C15<>\"\",Input!C15,\"\")","v":""}]
[{"$f":"Input!A16","v":9},{"$f":"IF(Input!B16<>\"\",Input!B16,\"\")","v":""},{"$f":"IF(Input!C16<>\"\",Input!C16,\"\")","v":""}]
[{"$f":"Input!A17","v":10},{"$f":"IF(Input!B17<>\"\",Input!B17,\"\")","v":""},{"$f":"IF(Input!C17<>\"\",Input!C17,\"\")","v":""}]
[{"$f":"Input!A18","v":11},{"$f":"IF(Input!B18<>\"\",Input!B18,\"\")","v":""},{"$f":"IF(Input!C18<>\"\",Input!C18,\"\")","v":""}]
[{"$f":"Input!A19","v":12},{"$f":"IF(Input!B19<>\"\",Input!B19,\"\")","v":""},{"$f":"IF(Input!C19<>\"\",Input!C19,\"\")","v":""}]
[{"$f":"Input!A20","v":13},{"$f":"IF(Input!B20<>\"\",Input!B20,\"\")","v":""},{"$f":"IF(Input!C20<>\"\",Input!C20,\"\")","v":""}]
[{"$f":"Input!A21","v":14},{"$f":"IF(Input!B21<>\"\",Input!B21,\"\")","v":""},{"$f":"IF(Input!C21<>\"\",Input!C21,\"\")","v":""}]
[{"$f":"Input!A22","v":15},{"$f":"IF(Input!B22<>\"\",Input!B22,\"\")","v":""},{"$f":"IF(Input!C22<>\"\",Input!C22,\"\")","v":""}]
[{"$f":"Input!A23","v":16},{"$f":"IF(Input!B23<>\"\",Input!B23,\"\")","v":""},{"$f":"IF(Input!C23<>\"\",Input!C23,\"\")","v":""}]
[{"$f":"Input!A24","v":17},{"$f":"IF(Input!B24<>\"\",Input!B24,\"\")","v":""},{"$f":"IF(Input!C24<>\"\",Input!C24,\"\")","v":""}]
[{"$f":"Input!A25","v":18},{"$f":"IF(Input!B25<>\"\",Input!B25,\"\")","v":""},{"$f":"IF(Input!C25<>\"\",Input!C25,\"\")","v":""}]
[{"$f":"Input!A26","v":19},{"$f":"IF(Input!B26<>\"\",Input!B26,\"\")","v":""},{"$f":"IF(Input!C26<>\"\",Input!C26,\"\")","v":""}]
[{"$f":"Input!A27","v":20},{"$f":"IF(Input!B27<>\"\",Input!B27,\"\")","v":""},{"$f":"IF(Input!C27<>\"\",Input!C27,\"\")","v":""}]
[{"$f":"Input!A28","v":21},{"$f":"IF(Input!B28<>\"\",Input!B28,\"\")","v":""},{"$f":"IF(Input!C28<>\"\",Input!C28,\"\")","v":""}]
[{"$f":"Input!A29","v":22},{"$f":"IF(Input!B29<>\"\",Input!B29,\"\")","v":""},{"$f":"IF(Input!C29<>\"\",Input!C29,\"\")","v":""}]
[{"$f":"Input!A30","v":23},{"$f":"IF(Input!B30<>\"\",Input!B30,\"\")","v":""},{"$f":"IF(Input!C30<>\"\",Input!C30,\"\")","v":""}]
[{"$f":"Input!A31","v":24},{"$f":"IF(Input!B31<>\"\",Input!B31,\"\")","v":""},{"$f":"IF(Input!C31<>\"\",Input!C31,\"\")","v":""}]
[{"$f":"Input!A32","v":25},{"$f":"IF(Input!B32<>\"\",Input!B32,\"\")","v":""},{"$f":"IF(Input!C32<>\"\",Input!C32,\"\")","v":""}]
[{"$f":"Input!A33","v":26},{"$f":"IF(Input!B33<>\"\",Input!B33,\"\")","v":""},{"$f":"IF(Input!C33<>\"\",Input!C33,\"\")","v":""}]
[{"$f":"Input!A34","v":27},{"$f":"IF(Input!B34<>\"\",Input!B34,\"\")","v":""},{"$f":"IF(Input!C34<>\"\",Input!C34,\"\")","v":""}]
[{"$f":"Input!A35","v":28},{"$f":"IF(Input!B35<>\"\",Input!B35,\"\")","v":""},{"$f":"IF(Input!C35<>\"\",Input!C35,\"\")","v":""}]
[{"$f":"Input!A36","v":29},{"$f":"IF(Input!B36<>\"\",Input!B36,\"\")","v":""},{"$f":"IF(Input!C36<>\"\",Input!C36,\"\")","v":""}]
[{"$f":"Input!A37","v":30},{"$f":"IF(Input!B37<>\"\",Input!B37,\"\")","v":""},{"$f":"IF(Input!C37<>\"\",Input!C37,\"\")","v":""}]
[{"$f":"Input!A45","v":31},{"$f":"IF(Input!B45<>\"\",Input!B45,\"\")","v":""},{"$f":"IF(Input!C45<>\"\",Input!C45,\"\")","v":""}]
[{"$f":"Input!A46","v":32},{"$f":"IF(Input!B46<>\"\",Input!B46,\"\")","v":""},{"$f":"IF(Input!C46<>\"\",Input!C46,\"\")","v":""}]
[{"$f":"Input!A47","v":33},{"$f":"IF(Input!B47<>\"\",Input!B47,\"\")","v":""},{"$f":"IF(Input!C47<>\"\",Input!C47,\"\")","v":""}]
[{"$f":"Input!A48","v":34},{"$f":"IF(Input!B48<>\"\",Input!B48,\"\")","v":""},{"$f":"IF(Input!C48<>\"\",Input!C48,\"\")","v":""}]
[{"$f":"Input!A49","v":35},{"$f":"IF(Input!B49<>\"\",Input!B49,\"\")","v":""},{"$f":"IF(Input!C49<>\"\",Input!C49,\"\")","v":""}]
[{"$f":"Input!A50","v":36},{"$f":"IF(Input!B50<>\"\",Input!B50,\"\")","v":""},{"$f":"IF(Input!C50<>\"\",Input!C50,\"\")","v":""}]
[{"$f":"Input!A51","v":37},{"$f":"IF(Input!B51<>\"\",Input!B51,\"\")","v":""},{"$f":"IF(Input!C51<>\"\",Input!C51,\"\")","v":""}]
[{"$f":"Input!A52","v":38},{"$f":"IF(Input!B52<>\"\",Input!B52,\"\")","v":""},{"$f":"IF(Input!C52<>\"\",Input!C52,\"\")","v":""}]
[{"$f":"Input!A53","v":39},{"$f":"IF(Input!B53<>\"\",Input!B53,\"\")","v":""},{"$f":"IF(Input!C53<>\"\",Input!C53,\"\")","v":""}]
[{"$f":"Input!A54","v":40},{"$f":"IF(Input!B54<>\"\",Input!B54,\"\")","v":""},{"$f":"IF(Input!C54<>\"\",Input!C54,\"\")","v":""}]
[{"$f":"Input!A55","v":41},{"$f":"IF(Input!B55<>\"\",Input!B55,\"\")","v":""},{"$f":"IF(Input!C55<>\"\",Input!C55,\"\")","v":""}]
[{"$f":"Input!A56","v":42},{"$f":"IF(Input!B56<>\"\",Input!B56,\"\")","v":""},{"$f":"IF(Input!C56<>\"\",Input!C56,\"\")","v":""}]
[{"$f":"Input!A57","v":43},{"$f":"IF(Input!B57<>\"\",Input!B57,\"\")","v":""},{"$f":"IF(Input!C57<>\"\",Input!C57,\"\")","v":""}]
[{"$f":"Input!A58","v":44},{"$f":"IF(Input!B58<>\"\",Input!B58,\"\")","v":""},{"$f":"IF(Input!C58<>\"\",Input!C58,\"\")","v":""}]
[{"$f":"Input!A59","v":45},{"$f":"IF(Input!B59<>\"\",Input!B59,\"\")","v":""},{"$f":"IF(Input!C59<>\"\",Input!C59,\"\")","v":""}]
[{"$f":"Input!A60","v":46},{"$f":"IF(Input!B60<>\"\",Input!B60,\"\")","v":""},{"$f":"IF(Input!C60<>\"\",Input!C60,\"\")","v":""}]
[{"$f":"Input!A61","v":47},{"$f":"IF(Input!B61<>\"\",Input!B61,\"\")","v":""},{"$f":"IF(Input!C61<>\"\",Input!C61,\"\")","v":""}]
[{"$f":"Input!A62","v":48},{"$f":"IF(Input!B62<>\"\",Input!B62,\"\")","v":""},{"$f":"IF(Input!C62<>\"\",Input!C62,\"\")","v":""}]
[{"$f":"Input!A63","v":49},{"$f":"IF(Input!B63<>\"\",Input!B63,\"\")","v":""},{"$f":"IF(Input!C63<>\"\",Input!C63,\"\")","v":""}]
[{"$f":"Input!A64","v":50},{"$f":"IF(Input!B64<>\"\",Input!B64,\"\")","v":""},{"$f":"IF(Input!C64<>\"\",Input!C64,\"\")","v":""}]
[{"$f":"Input!A65","v":51},{"$f":"IF(Input!B65<>\"\",Input!B65,\"\")","v":""},{"$f":"IF(Input!C65<>\"\",Input!C65,\"\")","v":""}]
[{"$f":"Input!A66","v":52},{"$f":"IF(Input!B66<>\"\",Input!B66,\"\")","v":""},{"$f":"IF(Input!C66<>\"\",Input!C66,\"\")","v":""}]
[{"$f":"Input!A67","v":53},{"$f":"IF(Input!B67<>\"\",Input!B67,\"\")","v":""},{"$f":"IF(Input!C67<>\"\",Input!C67,\"\")","v":""}]
[{"$f":"Input!A68","v":54},{"$f":"IF(Input!B68<>\"\",Input!B68,\"\")","v":""},{"$f":"IF(Input!C68<>\"\",Input!C68,\"\")","v":""}]
[{"$f":"Input!A69","v":55},{"$f":"IF(Input!B69<>\"\",Input!B69,\"\")","v":""},{"$f":"IF(Input!C69<>\"\",Input!C69,\"\")","v":""}]
[{"$f":"Input!A70","v":56},{"$f":"IF(Input!B70<>\"\",Input!B70,\"\")","v":""},{"$f":"IF(Input!C70<>\"\",Input!C70,\"\")","v":""}]
[{"$f":"Input!A71","v":57},{"$f":"IF(Input!B71<>\"\",Input!B71,\"\")","v":""},{"$f":"IF(Input!C71<>\"\",Input!C71,\"\")","v":""}]
[{"$f":"Input!A72","v":58},{"$f":"IF(Input!B72<>\"\",Input!B72,\"\")","v":""},{"$f":"IF(Input!C72<>\"\",Input!C72,\"\")","v":""}]
[{"$f":"Input!A73","v":59},{"$f":"IF(Input!B73<>\"\",Input!B73,\"\")","v":""},{"$f":"IF(Input!C73<>\"\",Input!C73,\"\")","v":""}]
[{"$f":"Input!A74","v":60},{"$f":"IF(Input!B74<>\"\",Input!B74,\"\")","v":""},{"$f":"IF(Input!C74<>\"\",Input!C74,\"\")","v":""}]
[{"$f":"Input!A75","v":61},{"$f":"IF(Input!B75<>\"\",Input!B75,\"\")","v":""},{"$f":"IF(Input!C75<>\"\",Input!C75,\"\")","v":""}]
[{"$f":"Input!A76","v":62},{"$f":"IF(Input!B76<>\"\",Input!B76,\"\")","v":""},{"$f":"IF(Input!C76<>\"\",Input!C76,\"\")","v":""}]
[{"$f":"Input!A77","v":63},{"$f":"IF(Input!B77<>\"\",Input!B77,\"\")","v":""},{"$f":"IF(Input!C77<>\"\",Input!C77,\"\")","v":""}]
[64,{"$f":"IF(Input!B85<>\"\",Input!B85,\"\")","v":""},{"$f":"IF(Input!C85<>\"\",Input!C85,\"\")","v":""}]
[65,{"$f":"IF(Input!B86<>\"\",Input!B86,\"\")","v":""},{"$f":"IF(Input!C86<>\"\",Input!C86,\"\")","v":""}]
[66,{"$f":"IF(Input!B87<>\"\",Input!B87,\"\")","v":""},{"$f":"IF(Input!C87<>\"\",Input!C87,\"\")","v":""}]
[67,{"$f":"IF(Input!B88<>\"\",Input!B88,\"\")","v":""},{"$f":"IF(Input!C88<>\"\",Input!C88,\"\")","v":""}]
[68,{"$f":"IF(Input!B89<>\"\",Input!B89,\"\")","v":""},{"$f":"IF(Input!C89<>\"\",Input!C89,\"\")","v":""}]
[69,{"$f":"IF(Input!B90<>\"\",Input!B90,\"\")","v":""},{"$f":"IF(Input!C90<>\"\",Input!C90,\"\")","v":""}]
[70,{"$f":"IF(Input!B91<>\"\",Input!B91,\"\")","v":""},{"$f":"IF(Input!C91<>\"\",Input!C91,\"\")","v":""}]
[71,{"$f":"IF(Input!B92<>\"\",Input!B92,\"\")","v":""},{"$f":"IF(Input!C92<>\"\",Input!C92,\"\")","v":""}]
[72,{"$f":"IF(Input!B93<>\"\",Input!B93,\"\")","v":""},{"$f":"IF(Input!C93<>\"\",Input!C93,\"\")","v":""}]
[73,{"$f":"IF(Input!B94<>\"\",Input!B94,\"\")","v":""},{"$f":"IF(Input!C94<>\"\",Input!C94,\"\")","v":""}]
[74,{"$f":"IF(Input!B95<>\"\",Input!B95,\"\")","v":""},{"$f":"IF(Input!C95<>\"\",Input!C95,\"\")","v":""}]
[75,{"$f":"IF(Input!B96<>\"\",Input!B96,\"\")","v":""},{"$f":"IF(Input!C96<>\"\",Input!C96,\"\")","v":""}]
[76,{"$f":"IF(Input!B97<>\"\",Input!B97,\"\")","v":""},{"$f":"IF(Input!C97<>\"\",Input!C97,\"\")","v":""}]
[77,{"$f":"IF(Input!B98<>\"\",Input!B98,\"\")","v":""},{"$f":"IF(Input!C98<>\"\",Input!C98,\"\")","v":""}]
[78,{"$f":"IF(Input!B99<>\"\",Input!B99,\"\")","v":""},{"$f":"IF(Input!C99<>\"\",Input!C99,\"\")","v":""}]
[79,{"$f":"IF(Input!B100<>\"\",Input!B100,\"\")","v":""},{"$f":"IF(Input!C100<>\"\",Input!C100,\"\")","v":""}]
[80,{"$f":"IF(Input!B101<>\"\",Input!B101,\"\")","v":""},{"$f":"IF(Input!C101<>\"\",Input!C101,\"\")","v":""}]
[81,{"$f":"IF(Input!B102<>\"\",Input!B102,\"\")","v":""},{"$f":"IF(Input!C102<>\"\",Input!C102,\"\")","v":""}]
[82,{"$f":"IF(Input!B103<>\"\",Input!B103,\"\")","v":""},{"$f":"IF(Input!C103<>\"\",Input!C103,\"\")","v":""}]
[83,{"$f":"IF(Input!B104<>\"\",Input!B104,\"\")","v":""},{"$f":"IF(Input!C104<>\"\",Input!C104,\"\")","v":""}]
[84,{"$f":"IF(Input!B105<>\"\",Input!B105,\"\")","v":""},{"$f":"IF(Input!C105<>\"\",Input!C105,\"\")","v":""}]
[85,{"$f":"IF(Input!B106<>\"\",Input!B106,\"\")","v":""},{"$f":"IF(Input!C106<>\"\",Input!C106,\"\")","v":""}]
[86,{"$f":"IF(Input!B107<>\"\",Input!B107,\"\")","v":""},{"$f":"IF(Input!C107<>\"\",Input!C107,\"\")","v":""}]
[87,{"$f":"IF(Input!B108<>\"\",Input!B108,\"\")","v":""},{"$f":"IF(Input!C108<>\"\",Input!C108,\"\")","v":""}]
[88,{"$f":"IF(Input!B109<>\"\",Input!B109,\"\")","v":""},{"$f":"IF(Input!C109<>\"\",Input!C109,\"\")","v":""}]
[89,{"$f":"IF(Input!B110<>\"\",Input!B110,\"\")","v":""},{"$f":"IF(Input!C110<>\"\",Input!C110,\"\")","v":""}]
[90,{"$f":"IF(Input!B111<>\"\",Input!B111,\"\")","v":""},{"$f":"IF(Input!C111<>\"\",Input!C111,\"\")","v":""}]
[91,{"$f":"IF(Input!B112<>\"\",Input!B112,\"\")","v":""},{"$f":"IF(Input!C112<>\"\",Input!C112,\"\")","v":""}]
[92,{"$f":"IF(Input!B113<>\"\",Input!B113,\"\")","v":""},{"$f":"IF(Input!C113<>\"\",Input!C113,\"\")","v":""}]
[93,{"$f":"IF(Input!B114<>\"\",Input!B114,\"\")","v":""},{"$f":"IF(Input!C114<>\"\",Input!C114,\"\")","v":""}]
[94,{"$f":"IF(Input!B115<>\"\",Input!B115,\"\")","v":""},{"$f":"IF(Input!C115<>\"\",Input!C115,\"\")","v":""}]
[95,{"$f":"IF(Input!B116<>\"\",Input!B116,\"\")","v":""},{"$f":"IF(Input!C116<>\"\",Input!C116,\"\")","v":""}]
[96,{"$f":"IF(Input!B117<>\"\",Input!B117,\"\")","v":""},{"$f":"IF(Input!C117<>\"\",Input!C117,\"\")","v":""}]
[97,{"$f":"IF(Input!B118<>\"\",Input!B118,\"\")","v":""},{"$f":"IF(Input!C118<>\"\",Input!C118,\"\")","v":""}]
[98,{"$f":"IF(Input!B126<>\"\",Input!B126,\"\")","v":""},{"$f":"IF(Input!C126<>\"\",Input!C126,\"\")","v":""}]
[99,{"$f":"IF(Input!B127<>\"\",Input!B127,\"\")","v":""},{"$f":"IF(Input!C127<>\"\",Input!C127,\"\")","v":""}]
[100,{"$f":"IF(Input!B128<>\"\",Input!B128,\"\")","v":""},{"$f":"IF(Input!C128<>\"\",Input!C128,\"\")","v":""}]
[101,{"$f":"IF(Input!B129<>\"\",Input!B129,\"\")","v":""},{"$f":"IF(Input!C129<>\"\",Input!C129,\"\")","v":""}]
[102,{"$f":"IF(Input!B130<>\"\",Input!B130,\"\")","v":""},{"$f":"IF(Input!C130<>\"\",Input!C130,\"\")","v":""}]
[103,{"$f":"IF(Input!B131<>\"\",Input!B131,\"\")","v":""},{"$f":"IF(Input!C131<>\"\",Input!C131,\"\")","v":""}]
[104,{"$f":"IF(Input!B132<>\"\",Input!B132,\"\")","v":""},{"$f":"IF(Input!C132<>\"\",Input!C132,\"\")","v":""}]
[105,{"$f":"IF(Input!B133<>\"\",Input!B133,\"\")","v":""},{"$f":"IF(Input!C133<>\"\",Input!C133,\"\")","v":""}]
[106,{"$f":"IF(Input!B134<>\"\",Input!B134,\"\")","v":""},{"$f":"IF(Input!C134<>\"\",Input!C134,\"\")","v":""}]
[107,{"$f":"IF(Input!B135<>\"\",Input!B135,\"\")","v":""},{"$f":"IF(Input!C135<>\"\",Input!C135,\"\")","v":""}]
[108,{"$f":"IF(Input!B136<>\"\",Input!B136,\"\")","v":""},{"$f":"IF(Input!C136<>\"\",Input!C136,\"\")","v":""}]
[109,{"$f":"IF(Input!B137<>\"\",Input!B137,\"\")","v":""},{"$f":"IF(Input!C137<>\"\",Input!C137,\"\")","v":""}]
[110,{"$f":"IF(Input!B138<>\"\",Input!B138,\"\")","v":""},{"$f":"IF(Input!C138<>\"\",Input!C138,\"\")","v":""}]
[111,{"$f":"IF(Input!B139<>\"\",Input!B139,\"\")","v":""},{"$f":"IF(Input!C139<>\"\",Input!C139,\"\")","v":""}]
[112,{"$f":"IF(Input!B140<>\"\",Input!B140,\"\")","v":""},{"$f":"IF(Input!C140<>\"\",Input!C140,\"\")","v":""}]
[113,{"$f":"IF(Input!B141<>\"\",Input!B141,\"\")","v":""},{"$f":"IF(Input!C141<>\"\",Input!C141,\"\")","v":""}]
[114,{"$f":"IF(Input!B142<>\"\",Input!B142,\"\")","v":""},{"$f":"IF(Input!C142<>\"\",Input!C142,\"\")","v":""}]
[115,{"$f":"IF(Input!B143<>\"\",Input!B143,\"\")","v":""},{"$f":"IF(Input!C143<>\"\",Input!C143,\"\")","v":""}]
[116,{"$f":"IF(Input!B144<>\"\",Input!B144,\"\")","v":""},{"$f":"IF(Input!C144<>\"\",Input!C144,\"\")","v":""}]
[117,{"$f":"IF(Input!B145<>\"\",Input!B145,\"\")","v":""},{"$f":"IF(Input!C145<>\"\",Input!C145,\"\")","v":""}]
[118,{"$f":"IF(Input!B146<>\"\",Input!B146,\"\")","v":""},{"$f":"IF(Input!C146<>\"\",Input!C146,\"\")","v":""}]
[119,{"$f":"IF(Input!B147<>\"\",Input!B147,\"\")","v":""},{"$f":"IF(Input!C147<>\"\",Input!C147,\"\")","v":""}]
[120,{"$f":"IF(Input!B148<>\"\",Input!B148,\"\")","v":""},{"$f":"IF(Input!C148<>\"\",Input!C148,\"\")","v":""}]
[121,{"$f":"IF(Input!B149<>\"\",Input!B149,\"\")","v":""},{"$f":"IF(Input!C149<>\"\",Input!C149,\"\")","v":""}]
[122,{"$f":"IF(Input!B150<>\"\",Input!B150,\"\")","v":""},{"$f":"IF(Input!C150<>\"\",Input!C150,\"\")","v":""}]
[123,{"$f":"IF(Input!B151<>\"\",Input!B151,\"\")","v":""},{"$f":"IF(Input!C151<>\"\",Input!C151,\"\")","v":""}]
[124,{"$f":"IF(Input!B152<>\"\",Input!B152,\"\")","v":""},{"$f":"IF(Input!C152<>\"\",Input!C152,\"\")","v":""}]
[125,{"$f":"IF(Input!B153<>\"\",Input!B153,\"\")","v":""},{"$f":"IF(Input!C153<>\"\",Input!C153,\"\")","v":""}]
[126,{"$f":"IF(Input!B154<>\"\",Input!B154,\"\")","v":""},{"$f":"IF(Input!C154<>\"\",Input!C154,\"\")","v":""}]
[127,{"$f":"IF(Input!B155<>\"\",Input!B155,\"\")","v":""},{"$f":"IF(Input!C155<>\"\",Input!C155,\"\")","v":""}]
[128,{"$f":"IF(Input!B156<>\"\",Input!B156,\"\")","v":""},{"$f":"IF(Input!C156<>\"\",Input!C156,\"\")","v":""}]
[129,{"$f":"IF(Input!B157<>\"\",Input!B157,\"\")","v":""},{"$f":"IF(Input!C157<>\"\",Input!C157,\"\")","v":""}]
[130,{"$f":"IF(Input!B158<>\"\",Input!B158,\"\")","v":""},{"$f":"IF(Input!C158<>\"\",Input!C158,\"\")","v":""}]
[131,{"$f":"IF(Input!B166<>\"\",Input!B166,\"\")","v":""},{"$f":"IF(Input!C166<>\"\",Input!C166,\"\")","v":""}]
[132,{"$f":"IF(Input!B167<>\"\",Input!B167,\"\")","v":""},{"$f":"IF(Input!C167<>\"\",Input!C167,\"\")","v":""}]
[133,{"$f":"IF(Input!B168<>\"\",Input!B168,\"\")","v":""},{"$f":"IF(Input!C168<>\"\",Input!C168,\"\")","v":""}]
[134,{"$f":"IF(Input!B169<>\"\",Input!B169,\"\")","v":""},{"$f":"IF(Input!C169<>\"\",Input!C169,\"\")","v":""}]
[135,{"$f":"IF(Input!B170<>\"\",Input!B170,\"\")","v":""},{"$f":"IF(Input!C170<>\"\",Input!C170,\"\")","v":""}]
[136,{"$f":"IF(Input!B171<>\"\",Input!B171,\"\")","v":""},{"$f":"IF(Input!C171<>\"\",Input!C171,\"\")","v":""}]
[137,{"$f":"IF(Input!B172<>\"\",Input!B172,\"\")","v":""},{"$f":"IF(Input!C172<>\"\",Input!C172,\"\")","v":""}]
[138,{"$f":"IF(Input!B173<>\"\",Input!B173,\"\")","v":""},{"$f":"IF(Input!C173<>\"\",Input!C173,\"\")","v":""}]
[139,{"$f":"IF(Input!B174<>\"\",Input!B174,\"\")","v":""},{"$f":"IF(Input!C174<>\"\",Input!C174,\"\")","v":""}]
[140,{"$f":"IF(Input!B175<>\"\",Input!B175,\"\")","v":""},{"$f":"IF(Input!C175<>\"\",Input!C175,\"\")","v":""}]
[141,{"$f":"IF(Input!B176<>\"\",Input!B176,\"\")","v":""},{"$f":"IF(Input!C176<>\"\",Input!C176,\"\")","v":""}]
[142,{"$f":"IF(Input!B177<>\"\",Input!B177,\"\")","v":""},{"$f":"IF(Input!C177<>\"\",Input!C177,\"\")","v":""}]
[143,{"$f":"IF(Input!B178<>\"\",Input!B178,\"\")","v":""},{"$f":"IF(Input!C178<>\"\",Input!C178,\"\")","v":""}]
[144,{"$f":"IF(Input!B179<>\"\",Input!B179,\"\")","v":""},{"$f":"IF(Input!C179<>\"\",Input!C179,\"\")","v":""}]
[145,{"$f":"IF(Input!B180<>\"\",Input!B180,\"\")","v":""},{"$f":"IF(Input!C180<>\"\",Input!C180,\"\")","v":""}]
[146,{"$f":"IF(Input!B181<>\"\",Input!B181,\"\")","v":""},{"$f":"IF(Input!C181<>\"\",Input!C181,\"\")","v":""}]
[147,{"$f":"IF(Input!B182<>\"\",Input!B182,\"\")","v":""},{"$f":"IF(Input!C182<>\"\",Input!C182,\"\")","v":""}]
[148,{"$f":"IF(Input!B183<>\"\",Input!B183,\"\")","v":""},{"$f":"IF(Input!C183<>\"\",Input!C183,\"\")","v":""}]
[149,{"$f":"IF(Input!B184<>\"\",Input!B184,\"\")","v":""},{"$f":"IF(Input!C184<>\"\",Input!C184,\"\")","v":""}]
[150,{"$f":"IF(Input!B185<>\"\",Input!B185,\"\")","v":""},{"$f":"IF(Input!C185<>\"\",Input!C185,\"\")","v":""}]
[151,{"$f":"IF(Input!B186<>\"\",Input!B186,\"\")","v":""},{"$f":"IF(Input!C186<>\"\",Input!C186,\"\")","v":""}]
[152,{"$f":"IF(Input!B187<>\"\",Input!B187,\"\")","v":""},{"$f":"IF(Input!C187<>\"\",Input!C187,\"\")","v":""}]
[153,{"$f":"IF(Input!B188<>\"\",Input!B188,\"\")","v":""},{"$f":"IF(Input!C188<>\"\",Input!C188,\"\")","v":""}]
[154,{"$f":"IF(Input!B189<>\"\",Input!B189,\"\")","v":""},{"$f":"IF(Input!C189<>\"\",Input!C189,\"\")","v":""}]
[155,{"$f":"IF(Input!B190<>\"\",Input!B190,\"\")","v":""},{"$f":"IF(Input!C190<>\"\",Input!C190,\"\")","v":""}]
[156,{"$f":"IF(Input!B191<>\"\",Input!B191,\"\")","v":""},{"$f":"IF(Input!C191<>\"\",Input!C191,\"\")","v":""}]
[157,{"$f":"IF(Input!B192<>\"\",Input!B192,\"\")","v":""},{"$f":"IF(Input!C192<>\"\",Input!C192,\"\")","v":""}]
[158,{"$f":"IF(Input!B193<>\"\",Input!B193,\"\")","v":""},{"$f":"IF(Input!C193<>\"\",Input!C193,\"\")","v":""}]
[159,{"$f":"IF(Input!B194<>\"\",Input!B194,\"\")","v":""},{"$f":"IF(Input!C194<>\"\",Input!C194,\"\")","v":""}]
[160,{"$f":"IF(Input!B195<>\"\",Input!B195,\"\")","v":""},{"$f":"IF(Input!C195<>\"\",Input!C195,\"\")","v":""}]
[161,{"$f":"IF(Input!B196<>\"\",Input!B196,\"\")","v":""},{"$f":"IF(Input!C196<>\"\",Input!C196,\"\")","v":""}]
[162,{"$f":"IF(Input!B197<>\"\",Input!B197,\"\")","v":""},{"$f":"IF(Input!C197<>\"\",Input!C197,\"\")","v":""}]
[163,{"$f":"IF(Input!B198<>\"\",Input!B198,\"\")","v":""},{"$f":"IF(Input!C198<>\"\",Input!C198,\"\")","v":""}]
[164,{"$f":"IF(Input!B206<>\"\",Input!B206,\"\")","v":""},{"$f":"IF(Input!C206<>\"\",Input!C206,\"\")","v":""}]
[165,{"$f":"IF(Input!B207<>\"\",Input!B207,\"\")","v":""},{"$f":"IF(Input!C207<>\"\",Input!C207,\"\")","v":""}]
[166,{"$f":"IF(Input!B208<>\"\",Input!B208,\"\")","v":""},{"$f":"IF(Input!C208<>\"\",Input!C208,\"\")","v":""}]
[167,{"$f":"IF(Input!B209<>\"\",Input!B209,\"\")","v":""},{"$f":"IF(Input!C209<>\"\",Input!C209,\"\")","v":""}]
[168,{"$f":"IF(Input!B210<>\"\",Input!B210,\"\")","v":""},{"$f":"IF(Input!C210<>\"\",Input!C210,\"\")","v":""}]
[169,{"$f":"IF(Input!B211<>\"\",Input!B211,\"\")","v":""},{"$f":"IF(Input!C211<>\"\",Input!C211,\"\")","v":""}]
[170,{"$f":"IF(Input!B212<>\"\",Input!B212,\"\")","v":""},{"$f":"IF(Input!C212<>\"\",Input!C212,\"\")","v":""}]
[171,{"$f":"IF(Input!B213<>\"\",Input!B213,\"\")","v":""},{"$f":"IF(Input!C213<>\"\",Input!C213,\"\")","v":""}]
[172,{"$f":"IF(Input!B214<>\"\",Input!B214,\"\")","v":""},{"$f":"IF(Input!C214<>\"\",Input!C214,\"\")","v":""}]
[173,{"$f":"IF(Input!B215<>\"\",Input!B215,\"\")","v":""},{"$f":"IF(Input!C215<>\"\",Input!C215,\"\")","v":""}]
[174,{"$f":"IF(Input!B216<>\"\",Input!B216,\"\")","v":""},{"$f":"IF(Input!C216<>\"\",Input!C216,\"\")","v":""}]
[175,{"$f":"IF(Input!B217<>\"\",Input!B217,\"\")","v":""},{"$f":"IF(Input!C217<>\"\",Input!C217,\"\")","v":""}]
[176,{"$f":"IF(Input!B218<>\"\",Input!B218,\"\")","v":""},{"$f":"IF(Input!C218<>\"\",Input!C218,\"\")","v":""}]
[177,{"$f":"IF(Input!B219<>\"\",Input!B219,\"\")","v":""},{"$f":"IF(Input!C219<>\"\",Input!C219,\"\")","v":""}]
[178,{"$f":"IF(Input!B220<>\"\",Input!B220,\"\")","v":""},{"$f":"IF(Input!C220<>\"\",Input!C220,\"\")","v":""}]
[179,{"$f":"IF(Input!B221<>\"\",Input!B221,\"\")","v":""},{"$f":"IF(Input!C221<>\"\",Input!C221,\"\")","v":""}]
[180,{"$f":"IF(Input!B222<>\"\",Input!B222,\"\")","v":""},{"$f":"IF(Input!C222<>\"\",Input!C222,\"\")","v":""}]
[181,{"$f":"IF(Input!B223<>\"\",Input!B223,\"\")","v":""},{"$f":"IF(Input!C223<>\"\",Input!C223,\"\")","v":""}]
[182,{"$f":"IF(Input!B224<>\"\",Input!B224,\"\")","v":""},{"$f":"IF(Input!C224<>\"\",Input!C224,\"\")","v":""}]
[183,{"$f":"IF(Input!B225<>\"\",Input!B225,\"\")","v":""},{"$f":"IF(Input!C225<>\"\",Input!C225,\"\")","v":""}]
[184,{"$f":"IF(Input!B226<>\"\",Input!B226,\"\")","v":""},{"$f":"IF(Input!C226<>\"\",Input!C226,\"\")","v":""}]
[185,{"$f":"IF(Input!B227<>\"\",Input!B227,\"\")","v":""},{"$f":"IF(Input!C227<>\"\",Input!C227,\"\")","v":""}]
[186,{"$f":"IF(Input!B228<>\"\",Input!B228,\"\")","v":""},{"$f":"IF(Input!C228<>\"\",Input!C228,\"\")","v":""}]
[187,{"$f":"IF(Input!B229<>\"\",Input!B229,\"\")","v":""},{"$f":"IF(Input!C229<>\"\",Input!C229,\"\")","v":""}]
[188,{"$f":"IF(Input!B230<>\"\",Input!B230,\"\")","v":""},{"$f":"IF(Input!C230<>\"\",Input!C230,\"\")","v":""}]
[189,{"$f":"IF(Input!B231<>\"\",Input!B231,\"\")","v":""},{"$f":"IF(Input!C231<>\"\",Input!C231,\"\")","v":""}]
[190,{"$f":"IF(Input!B232<>\"\",Input!B232,\"\")","v":""},{"$f":"IF(Input!C232<>\"\",Input!C232,\"\")","v":""}]
[191,{"$f":"IF(Input!B233<>\"\",Input!B233,\"\")","v":""},{"$f":"IF(Input!C233<>\"\",Input!C233,\"\")","v":""}]
[192,{"$f":"IF(Input!B234<>\"\",Input!B234,\"\")","v":""},{"$f":"IF(Input!C234<>\"\",Input!C234,\"\")","v":""}]
[193,{"$f":"IF(Input!B235<>\"\",Input!B235,\"\")","v":""},{"$f":"IF(Input!C235<>\"\",Input!C235,\"\")","v":""}]
[194,{"$f":"IF(Input!B236<>\"\",Input!B236,\"\")","v":""},{"$f":"IF(Input!C236<>\"\",Input!C236,\"\")","v":""}]
[195,{"$f":"IF(Input!B237<>\"\",Input!B237,\"\")","v":""},{"$f":"IF(Input!C237<>\"\",Input!C237,\"\")","v":""}]
[196,{"$f":"IF(Input!B238<>\"\",Input!B238,\"\")","v":""},{"$f":"IF(Input!C238<>\"\",Input!C238,\"\")","v":""}]
[197,{"$f":"IF(Input!B246<>\"\",Input!B246,\"\")","v":""},{"$f":"IF(Input!C246<>\"\",Input!C246,\"\")","v":""}]
[198,{"$f":"IF(Input!B247<>\"\",Input!B247,\"\")","v":""},{"$f":"IF(Input!C247<>\"\",Input!C247,\"\")","v":""}]
{"$rows_left_out":52}