{"text_format":"3","workbook":"xlsx","n_sheets":3,"sheets":["For Honeywell","Lists","1"],"not_rendered":{"macros":1,"defined_names":6},"read":"whole","date_system":"1900"}

{"sheet":"For Honeywell","index":0,"n_rows":5,"n_cols":4,"rows_kept":5,"merged":[[3,1,3,5],[4,1,4,2],[4,3,4,5]]}
[]
[]
[]
[null,"FWE oppsett Decimal eller HEX for tekstimport"]
[null,"Velg i drop down:",null,"Decimal"]

{"sheet":"Lists","index":1,"n_rows":127,"n_cols":13,"rows_kept":127,"hidden":true}
[{"$nulls":12},"Decimal"]
[1,1,"802171 - IQ8Quad termisk maks, A1S","Overskriv med JA eller NEI",{"$nulls":8},"Hex"]
[2,2,"802177 - IQ8Quad termisk maks, BS","Overskriv med JA eller NEI"]
[3,3,"802271 - IQ8Quad termisk differensial, A1R","Overskriv med JA eller NEI"]
[4,4,"802371 - IQ8Quad optisk røykdetektor, O","Overskriv med JA eller NEI"]
[5,5,"802373 - IQ8Quad multisensor, optisk/termisk, OT","Overskriv med JA eller NEI"]
[6,6,"802374 - IQ8Quad multisensor optisk, optisk/termisk, O2T","Overskriv med JA eller NEI"]
[7,7,"802375 - IQ8Quad multisensor optisk/term., Otblue","Overskriv med JA eller NEI"]
[8,8,"802379 - IQ8Quad - kanaldetektor Otblue","Ikke relevant"]
[9,9,"802382 - IQ8Quad, optisk med summer (O/So)","Ikke relevant",2]
[10,10,"802383 - IQ8Quad O²T med flash (O2T/F)","Ikke relevant",2]
[11,11,"802384 - IQ8Quad O²T med summer (O2T/So)","Ikke relevant",2]
[12,12,"802385 - IQ8Quad O²T med flash og summer (O2T/FSp)","Ikke relevant",3]
[13,13,"802473 - IQ8Quad multisensor optisk/termisk/CO, OTG","Overskriv med JA eller NEI"]
[14,14,"803171 - IQ8Quad termisk maks, A1S for kalde omgivelser","Overskriv med JA eller NEI"]
[15,15,"804971/804961 - Manuell melder","Ikke relevant"]
[16,16,"807205(W/R) - IQ8Alarm/So","Ikke relevant",3]
[17,17,"807214RR - IQ8Alarm/F","Ikke relevant",3]
[18,18,"807224(RR/RW) - IQ8Alarm/FSo","Ikke relevant",4.5]
[19,19,"807372RR.N0 - IQ8Alarm/FSp","Ikke relevant",7]
[20,20,"808606 - Transponder IQ8FCT XS","Ikke relevant"]
[21,21,"808610.10 - Esser transponder utgangsmodul - 12 reléer","Ikke relevant"]
[22,22,"808621 - Transponder IQ8FCT LP","Ikke relevant"]
[23,23,"808623 - Esser Transponder 4 inn/2 ut","Ikke relevant"]
[24,24,"808630.10 - Esser transponder fremmedmelder","Ikke relevant"]
[25,25]
[26,26]
[27,27]
[28,28]
[29,29]
[30,30]
[31,31]
[32,32]
[33,33]
[34,34]
[35,35]
[36,36]
[37,37]
[38,38]
[39,39]
{"$rows_left_out":88}
{"sheet":"1","index":2,"n_rows":133,"n_cols":10,"rows_kept":133,"merged":[[1,0,1,1],[2,0,2,1]]}
[null,null,{"$f":"'For Honeywell'!$D5","v":"Decimal"},{"$f":"\"Total lastfaktor for sløyfe: \"&SUM(F6:F131)","v":"Total lastfaktor for sløyfe: 0"}]
["Sløyfenummer",null,1,{"$nulls":6},"Eksempler på gode tekster:"]
["Antall adresser",null,1]
[{"$nulls":9},"02.001 BYGG A 1.ETG KORRIDOR VED RESEPSJON "]
["Detektornr.","Detektornavn (Bruk STORE BOKSTAVER)","Antall tegn","Detektortype","Relesokkel","Lastfaktor",{"$nulls":3},"02.002 BYGG A 1.ETG KORRIDOR VED RESEPSJON M.M"]
[{"$f":"_xlfn.IFS(C1=\"Decimal\",(IF(INT(RIGHT(CONCATENATE(IF($C$2<10,CONCATENATE(\"0\",$C$2),$C$2),\".\",\"001\"),3))<($C$3+1),CONCATENATE(IF($C$2<10,CONCATENATE(\"0\",$C$2),$C$2),\".\",\"001\"),\"\")),C1=\"Hex\",(IF(INT(RIGHT(CONCATENATE(IF($C$2<10,CONCATENATE(\"0\",$C$2),$C$2),\".\",\"001\"),3))<($C$3+1),CONCATENATE(DEC2HEX($C$2),\".\",\"001\"),\"\")))","v":"01.001"},"",{"$f":"IF(LEN(B6)=0,\"\",LEN(B6))","v":""},null,{"$f":"IFERROR(VLOOKUP(D6,Lists!C:D,2,FALSE),\"\")","v":""},{"$f":"IFERROR(VLOOKUP(D6,Lists!C:E,3,FALSE),\"\")","v":""},{"$nulls":3},"02.003 BYGG A 2.ETG KONTOR VED DAMETOALETT O.H"]
[{"$f":"_xlfn.IFS(C1=\"Decimal\",(IF(INT(RIGHT(CONCATENATE(IF($C$2<10,CONCATENATE(\"0\",$C$2),$C$2),\".\",\"002\"),3))<($C$3+1),CONCATENATE(IF($C$2<10,CONCATENATE(\"0\",$C$2),$C$2),\".\",\"002\"),\"\")),C1=\"Hex\",(IF(INT(RIGHT(CONCATENATE(IF($C$2<10,CONCATENATE(\"0\",$C$2),$C$2),\".\",\"002\"),3))<($C$3+1),CONCATENATE(DEC2HEX($C$2),\".\",\"002\"),\"\")))","v":""},"",{"$f":"IF(LEN(B7)=0,\"\",LEN(B7))","v":""},null,{"$f":"IFERROR(VLOOKUP(D7,Lists!C:D,2,FALSE),\"\")","v":""},{"$f":"IFERROR(VLOOKUP(D7,Lists!C:E,3,FALSE),\"\")","v":""},{"$nulls":3},"02.004 BYGG A 2.ETG DATAROM U.G"]
[{"$f":"_xlfn.IFS(C1=\"Decimal\",(IF(INT(RIGHT(CONCATENATE(IF($C$2<10,CONCATENATE(\"0\",$C$2),$C$2),\".\",\"003\"),3))<($C$3+1),CONCATENATE(IF($C$2<10,CONCATENATE(\"0\",$C$2),$C$2),\".\",\"003\"),\"\")),C1=\"Hex\",(IF(INT(RIGHT(CONCATENATE(IF($C$2<10,CONCATENATE(\"0\",$C$2),$C$2),\".\",\"003\"),3))<($C$3+1),CONCATENATE(DEC2HEX($C$2),\".\",\"003\"),\"\")))","v":""},"","",null,{"$f":"IFERROR(VLOOKUP(D8,Lists!C:D,2,FALSE),\"\")","v":""},{"$f":"IFERROR(VLOOKUP(D8,Lists!C:E,3,FALSE),\"\")","v":""},{"$nulls":3},"FORKLARING: M.M = MANUELL MELDER,   O.H = OVER HIMLING,   U.G = UNDER GULV"]
[{"$f":"_xlfn.IFS(C1=\"Decimal\",(IF(INT(RIGHT(CONCATENATE(IF($C$2<10,CONCATENATE(\"0\",$C$2),$C$2),\".\",\"004\"),3))<($C$3+1),CONCATENATE(IF($C$2<10,CONCATENATE(\"0\",$C$2),$C$2),\".\",\"004\"),\"\")),C1=\"Hex\",(IF(INT(RIGHT(CONCATENATE(IF($C$2<10,CONCATENATE(\"0\",$C$2),$C$2),\".\",\"004\"),3))<($C$3+1),CONCATENATE(DEC2HEX($C$2),\".\",\"004\"),\"\")))","v":""},"","",null,{"$f":"IFERROR(VLOOKUP(D9,Lists!C:D,2,FALSE),\"\")","v":""},{"$f":"IFERROR(VLOOKUP(D9,Lists!C:E,3,FALSE),\"\")","v":""}]
[{"$f":"_xlfn.IFS(C1=\"Decimal\",(IF(INT(RIGHT(CONCATENATE(IF($C$2<10,CONCATENATE(\"0\",$C$2),$C$2),\".\",\"005\"),3))<($C$3+1),CONCATENATE(IF($C$2<10,CONCATENATE(\"0\",$C$2),$C$2),\".\",\"005\"),\"\")),C1=\"Hex\",(IF(INT(RIGHT(CONCATENATE(IF($C$2<10,CONCATENATE(\"0\",$C$2),$C$2),\".\",\"005\"),3))<($C$3+1),CONCATENATE(DEC2HEX($C$2),\".\",\"005\"),\"\")))","v":""},"","",null,{"$f":"IFERROR(VLOOKUP(D10,Lists!C:D,2,FALSE),\"\")","v":""},{"$f":"IFERROR(VLOOKUP(D10,Lists!C:E,3,FALSE),\"\")","v":""}]
[{"$f":"_xlfn.IFS(C1=\"Decimal\",(IF(INT(RIGHT(CONCATENATE(IF($C$2<10,CONCATENATE(\"0\",$C$2),$C$2),\".\",\"006\"),3))<($C$3+1),CONCATENATE(IF($C$2<10,CONCATENATE(\"0\",$C$2),$C$2),\".\",\"006\"),\"\")),C1=\"Hex\",(IF(INT(RIGHT(CONCATENATE(IF($C$2<10,CONCATENATE(\"0\",$C$2),$C$2),\".\",\"006\"),3))<($C$3+1),CONCATENATE(DEC2HEX($C$2),\".\",\"006\"),\"\")))","v":""},"","",null,{"$f":"IFERROR(VLOOKUP(D11,Lists!C:D,2,FALSE),\"\")","v":""},{"$f":"IFERROR(VLOOKUP(D11,Lists!C:E,3,FALSE),\"\")","v":""}]
[{"$f":"_xlfn.IFS(C1=\"Decimal\",(IF(INT(RIGHT(CONCATENATE(IF($C$2<10,CONCATENATE(\"0\",$C$2),$C$2),\".\",\"007\"),3))<($C$3+1),CONCATENATE(IF($C$2<10,CONCATENATE(\"0\",$C$2),$C$2),\".\",\"007\"),\"\")),C1=\"Hex\",(IF(INT(RIGHT(CONCATENATE(IF($C$2<10,CONCATENATE(\"0\",$C$2),$C$2),\".\",\"007\"),3))<($C$3+1),CONCATENATE(DEC2HEX($C$2),\".\",\"007\"),\"\")))","v":""},"","",null,{"$f":"IFERROR(VLOOKUP(D12,Lists!C:D,2,FALSE),\"\")","v":""},{"$f":"IFERROR(VLOOKUP(D12,Lists!C:E,3,FALSE),\"\")","v":""}]
[{"$f":"_xlfn.IFS(C1=\"Decimal\",(IF(INT(RIGHT(CONCATENATE(IF($C$2<10,CONCATENATE(\"0\",$C$2),$C$2),\".\",\"008\"),3))<($C$3+1),CONCATENATE(IF($C$2<10,CONCATENATE(\"0\",$C$2),$C$2),\".\",\"008\"),\"\")),C1=\"Hex\",(IF(INT(RIGHT(CONCATENATE(IF($C$2<10,CONCATENATE(\"0\",$C$2),$C$2),\".\",\"008\"),3))<($C$3+1),CONCATENATE(DEC2HEX($C$2),\".\",\"008\"),\"\")))","v":""},"","",null,{"$f":"IFERROR(VLOOKUP(D13,Lists!C:D,2,FALSE),\"\")","v":""},{"$f":"IFERROR(VLOOKUP(D13,Lists!C:E,3,FALSE),\"\")","v":""}]
[{"$f":"_xlfn.IFS(C1=\"Decimal\",(IF(INT(RIGHT(CONCATENATE(IF($C$2<10,CONCATENATE(\"0\",$C$2),$C$2),\".\",\"009\"),3))<($C$3+1),CONCATENATE(IF($C$2<10,CONCATENATE(\"0\",$C$2),$C$2),\".\",\"009\"),\"\")),C1=\"Hex\",(IF(INT(RIGHT(CONCATENATE(IF($C$2<10,CONCATENATE(\"0\",$C$2),$C$2),\".\",\"009\"),3))<($C$3+1),CONCATENATE(DEC2HEX($C$2),\".\",\"009\"),\"\")))","v":""},"","",null,{"$f":"IFERROR(VLOOKUP(D14,Lists!C:D,2,FALSE),\"\")","v":""},{"$f":"IFERROR(VLOOKUP(D14,Lists!C:E,3,FALSE),\"\")","v":""}]
[{"$f":"_xlfn.IFS(C1=\"Decimal\",(IF(INT(RIGHT(CONCATENATE(IF($C$2<10,CONCATENATE(\"0\",$C$2),$C$2),\".\",\"010\"),3))<($C$3+1),CONCATENATE(IF($C$2<10,CONCATENATE(\"0\",$C$2),$C$2),\".\",\"010\"),\"\")),C1=\"Hex\",(IF(INT(RIGHT(CONCATENATE(IF($C$2<10,CONCATENATE(\"0\",$C$2),$C$2),\".\",\"010\"),3))<($C$3+1),CONCATENATE(DEC2HEX($C$2),\".\",\"010\"),\"\")))","v":""},"","",null,{"$f":"IFERROR(VLOOKUP(D15,Lists!C:D,2,FALSE),\"\")","v":""},{"$f":"IFERROR(VLOOKUP(D15,Lists!C:E,3,FALSE),\"\")","v":""}]
[{"$f":"_xlfn.IFS(C1=\"Decimal\",(IF(INT(RIGHT(CONCATENATE(IF($C$2<10,CONCATENATE(\"0\",$C$2),$C$2),\".\",\"011\"),3))<($C$3+1),CONCATENATE(IF($C$2<10,CONCATENATE(\"0\",$C$2),$C$2),\".\",\"011\"),\"\")),C1=\"Hex\",(IF(INT(RIGHT(CONCATENATE(IF($C$2<10,CONCATENATE(\"0\",$C$2),$C$2),\".\",\"011\"),3))<($C$3+1),CONCATENATE(DEC2HEX($C$2),\".\",\"011\"),\"\")))","v":""},"","",null,{"$f":"IFERROR(VLOOKUP(D16,Lists!C:D,2,FALSE),\"\")","v":""},{"$f":"IFERROR(VLOOKUP(D16,Lists!C:E,3,FALSE),\"\")","v":""}]
[{"$f":"_xlfn.IFS(C1=\"Decimal\",(IF(INT(RIGHT(CONCATENATE(IF($C$2<10,CONCATENATE(\"0\",$C$2),$C$2),\".\",\"012\"),3))<($C$3+1),CONCATENATE(IF($C$2<10,CONCATENATE(\"0\",$C$2),$C$2),\".\",\"012\"),\"\")),C1=\"Hex\",(IF(INT(RIGHT(CONCATENATE(IF($C$2<10,CONCATENATE(\"0\",$C$2),$C$2),\".\",\"012\"),3))<($C$3+1),CONCATENATE(DEC2HEX($C$2),\".\",\"012\"),\"\")))","v":""},"","",null,{"$f":"IFERROR(VLOOKUP(D17,Lists!C:D,2,FALSE),\"\")","v":""},{"$f":"IFERROR(VLOOKUP(D17,Lists!C:E,3,FALSE),\"\")","v":""}]
[{"$f":"_xlfn.IFS(C1=\"Decimal\",(IF(INT(RIGHT(CONCATENATE(IF($C$2<10,CONCATENATE(\"0\",$C$2),$C$2),\".\",\"013\"),3))<($C$3+1),CONCATENATE(IF($C$2<10,CONCATENATE(\"0\",$C$2),$C$2),\".\",\"013\"),\"\")),C1=\"Hex\",(IF(INT(RIGHT(CONCATENATE(IF($C$2<10,CONCATENATE(\"0\",$C$2),$C$2),\".\",\"013\"),3))<($C$3+1),CONCATENATE(DEC2HEX($C$2),\".\",\"013\"),\"\")))","v":""},"","",null,{"$f":"IFERROR(VLOOKUP(D18,Lists!C:D,2,FALSE),\"\")","v":""},{"$f":"IFERROR(VLOOKUP(D18,Lists!C:E,3,FALSE),\"\")","v":""}]
[{"$f":"_xlfn.IFS(C1=\"Decimal\",(IF(INT(RIGHT(CONCATENATE(IF($C$2<10,CONCATENATE(\"0\",$C$2),$C$2),\".\",\"014\"),3))<($C$3+1),CONCATENATE(IF($C$2<10,CONCATENATE(\"0\",$C$2),$C$2),\".\",\"014\"),\"\")),C1=\"Hex\",(IF(INT(RIGHT(CONCATENATE(IF($C$2<10,CONCATENATE(\"0\",$C$2),$C$2),\".\",\"014\"),3))<($C$3+1),CONCATENATE(DEC2HEX($C$2),\".\",\"014\"),\"\")))","v":""},"","",null,{"$f":"IFERROR(VLOOKUP(D19,Lists!C:D,2,FALSE),\"\")","v":""},{"$f":"IFERROR(VLOOKUP(D19,Lists!C:E,3,FALSE),\"\")","v":""}]
[{"$f":"_xlfn.IFS(C1=\"Decimal\",(IF(INT(RIGHT(CONCATENATE(IF($C$2<10,CONCATENATE(\"0\",$C$2),$C$2),\".\",\"015\"),3))<($C$3+1),CONCATENATE(IF($C$2<10,CONCATENATE(\"0\",$C$2),$C$2),\".\",\"015\"),\"\")),C1=\"Hex\",(IF(INT(RIGHT(CONCATENATE(IF($C$2<10,CONCATENATE(\"0\",$C$2),$C$2),\".\",\"015\"),3))<($C$3+1),CONCATENATE(DEC2HEX($C$2),\".\",\"015\"),\"\")))","v":""},"","",null,{"$f":"IFERROR(VLOOKUP(D20,Lists!C:D,2,FALSE),\"\")","v":""},{"$f":"IFERROR(VLOOKUP(D20,Lists!C:E,3,FALSE),\"\")","v":""}]
[{"$f":"_xlfn.IFS(C1=\"Decimal\",(IF(INT(RIGHT(CONCATENATE(IF($C$2<10,CONCATENATE(\"0\",$C$2),$C$2),\".\",\"016\"),3))<($C$3+1),CONCATENATE(IF($C$2<10,CONCATENATE(\"0\",$C$2),$C$2),\".\",\"016\"),\"\")),C1=\"Hex\",(IF(INT(RIGHT(CONCATENATE(IF($C$2<10,CONCATENATE(\"0\",$C$2),$C$2),\".\",\"016\"),3))<($C$3+1),CONCATENATE(DEC2HEX($C$2),\".\",\"016\"),\"\")))","v":""},"","",null,{"$f":"IFERROR(VLOOKUP(D21,Lists!C:D,2,FALSE),\"\")","v":""},{"$f":"IFERROR(VLOOKUP(D21,Lists!C:E,3,FALSE),\"\")","v":""}]
[{"$f":"_xlfn.IFS(C1=\"Decimal\",(IF(INT(RIGHT(CONCATENATE(IF($C$2<10,CONCATENATE(\"0\",$C$2),$C$2),\".\",\"017\"),3))<($C$3+1),CONCATENATE(IF($C$2<10,CONCATENATE(\"0\",$C$2),$C$2),\".\",\"017\"),\"\")),C1=\"Hex\",(IF(INT(RIGHT(CONCATENATE(IF($C$2<10,CONCATENATE(\"0\",$C$2),$C$2),\".\",\"017\"),3))<($C$3+1),CONCATENATE(DEC2HEX($C$2),\".\",\"017\"),\"\")))","v":""},"","",null,{"$f":"IFERROR(VLOOKUP(D22,Lists!C:D,2,FALSE),\"\")","v":""},{"$f":"IFERROR(VLOOKUP(D22,Lists!C:E,3,FALSE),\"\")","v":""}]
[{"$f":"_xlfn.IFS(C1=\"Decimal\",(IF(INT(RIGHT(CONCATENATE(IF($C$2<10,CONCATENATE(\"0\",$C$2),$C$2),\".\",\"018\"),3))<($C$3+1),CONCATENATE(IF($C$2<10,CONCATENATE(\"0\",$C$2),$C$2),\".\",\"018\"),\"\")),C1=\"Hex\",(IF(INT(RIGHT(CONCATENATE(IF($C$2<10,CONCATENATE(\"0\",$C$2),$C$2),\".\",\"018\"),3))<($C$3+1),CONCATENATE(DEC2HEX($C$2),\".\",\"018\"),\"\")))","v":""},"","",null,{"$f":"IFERROR(VLOOKUP(D23,Lists!C:D,2,FALSE),\"\")","v":""},{"$f":"IFERROR(VLOOKUP(D23,Lists!C:E,3,FALSE),\"\")","v":""}]
[{"$f":"_xlfn.IFS(C1=\"Decimal\",(IF(INT(RIGHT(CONCATENATE(IF($C$2<10,CONCATENATE(\"0\",$C$2),$C$2),\".\",\"019\"),3))<($C$3+1),CONCATENATE(IF($C$2<10,CONCATENATE(\"0\",$C$2),$C$2),\".\",\"019\"),\"\")),C1=\"Hex\",(IF(INT(RIGHT(CONCATENATE(IF($C$2<10,CONCATENATE(\"0\",$C$2),$C$2),\".\",\"019\"),3))<($C$3+1),CONCATENATE(DEC2HEX($C$2),\".\",\"019\"),\"\")))","v":""},"","",null,{"$f":"IFERROR(VLOOKUP(D24,Lists!C:D,2,FALSE),\"\")","v":""},{"$f":"IFERROR(VLOOKUP(D24,Lists!C:E,3,FALSE),\"\")","v":""}]
[{"$f":"_xlfn.IFS(C1=\"Decimal\",(IF(INT(RIGHT(CONCATENATE(IF($C$2<10,CONCATENATE(\"0\",$C$2),$C$2),\".\",\"020\"),3))<($C$3+1),CONCATENATE(IF($C$2<10,CONCATENATE(\"0\",$C$2),$C$2),\".\",\"020\"),\"\")),C1=\"Hex\",(IF(INT(RIGHT(CONCATENATE(IF($C$2<10,CONCATENATE(\"0\",$C$2),$C$2),\".\",\"020\"),3))<($C$3+1),CONCATENATE(DEC2HEX($C$2),\".\",\"020\"),\"\")))","v":""},"","",null,{"$f":"IFERROR(VLOOKUP(D25,Lists!C:D,2,FALSE),\"\")","v":""},{"$f":"IFERROR(VLOOKUP(D25,Lists!C:E,3,FALSE),\"\")","v":""}]
[{"$f":"_xlfn.IFS(C1=\"Decimal\",(IF(INT(RIGHT(CONCATENATE(IF($C$2<10,CONCATENATE(\"0\",$C$2),$C$2),\".\",\"021\"),3))<($C$3+1),CONCATENATE(IF($C$2<10,CONCATENATE(\"0\",$C$2),$C$2),\".\",\"021\"),\"\")),C1=\"Hex\",(IF(INT(RIGHT(CONCATENATE(IF($C$2<10,CONCATENATE(\"0\",$C$2),$C$2),\".\",\"021\"),3))<($C$3+1),CONCATENATE(DEC2HEX($C$2),\".\",\"021\"),\"\")))","v":""},"","",null,{"$f":"IFERROR(VLOOKUP(D26,Lists!C:D,2,FALSE),\"\")","v":""},{"$f":"IFERROR(VLOOKUP(D26,Lists!C:E,3,FALSE),\"\")","v":""}]
[{"$f":"_xlfn.IFS(C1=\"Decimal\",(IF(INT(RIGHT(CONCATENATE(IF($C$2<10,CONCATENATE(\"0\",$C$2),$C$2),\".\",\"022\"),3))<($C$3+1),CONCATENATE(IF($C$2<10,CONCATENATE(\"0\",$C$2),$C$2),\".\",\"022\"),\"\")),C1=\"Hex\",(IF(INT(RIGHT(CONCATENATE(IF($C$2<10,CONCATENATE(\"0\",$C$2),$C$2),\".\",\"022\"),3))<($C$3+1),CONCATENATE(DEC2HEX($C$2),\".\",\"022\"),\"\")))","v":""},"","",null,{"$f":"IFERROR(VLOOKUP(D27,Lists!C:D,2,FALSE),\"\")","v":""},{"$f":"IFERROR(VLOOKUP(D27,Lists!C:E,3,FALSE),\"\")","v":""}]
[{"$f":"_xlfn.IFS(C1=\"Decimal\",(IF(INT(RIGHT(CONCATENATE(IF($C$2<10,CONCATENATE(\"0\",$C$2),$C$2),\".\",\"023\"),3))<($C$3+1),CONCATENATE(IF($C$2<10,CONCATENATE(\"0\",$C$2),$C$2),\".\",\"023\"),\"\")),C1=\"Hex\",(IF(INT(RIGHT(CONCATENATE(IF($C$2<10,CONCATENATE(\"0\",$C$2),$C$2),\".\",\"023\"),3))<($C$3+1),CONCATENATE(DEC2HEX($C$2),\".\",\"023\"),\"\")))","v":""},"","",null,{"$f":"IFERROR(VLOOKUP(D28,Lists!C:D,2,FALSE),\"\")","v":""},{"$f":"IFERROR(VLOOKUP(D28,Lists!C:E,3,FALSE),\"\")","v":""}]
[{"$f":"_xlfn.IFS(C1=\"Decimal\",(IF(INT(RIGHT(CONCATENATE(IF($C$2<10,CONCATENATE(\"0\",$C$2),$C$2),\".\",\"024\"),3))<($C$3+1),CONCATENATE(IF($C$2<10,CONCATENATE(\"0\",$C$2),$C$2),\".\",\"024\"),\"\")),C1=\"Hex\",(IF(INT(RIGHT(CONCATENATE(IF($C$2<10,CONCATENATE(\"0\",$C$2),$C$2),\".\",\"024\"),3))<($C$3+1),CONCATENATE(DEC2HEX($C$2),\".\",\"024\"),\"\")))","v":""},"","",null,{"$f":"IFERROR(VLOOKUP(D29,Lists!C:D,2,FALSE),\"\")","v":""},{"$f":"IFERROR(VLOOKUP(D29,Lists!C:E,3,FALSE),\"\")","v":""}]
[{"$f":"_xlfn.IFS(C1=\"Decimal\",(IF(INT(RIGHT(CONCATENATE(IF($C$2<10,CONCATENATE(\"0\",$C$2),$C$2),\".\",\"025\"),3))<($C$3+1),CONCATENATE(IF($C$2<10,CONCATENATE(\"0\",$C$2),$C$2),\".\",\"025\"),\"\")),C1=\"Hex\",(IF(INT(RIGHT(CONCATENATE(IF($C$2<10,CONCATENATE(\"0\",$C$2),$C$2),\".\",\"025\"),3))<($C$3+1),CONCATENATE(DEC2HEX($C$2),\".\",\"025\"),\"\")))","v":""},"","",null,{"$f":"IFERROR(VLOOKUP(D30,Lists!C:D,2,FALSE),\"\")","v":""},{"$f":"IFERROR(VLOOKUP(D30,Lists!C:E,3,FALSE),\"\")","v":""}]
[{"$f":"_xlfn.IFS(C1=\"Decimal\",(IF(INT(RIGHT(CONCATENATE(IF($C$2<10,CONCATENATE(\"0\",$C$2),$C$2),\".\",\"026\"),3))<($C$3+1),CONCATENATE(IF($C$2<10,CONCATENATE(\"0\",$C$2),$C$2),\".\",\"026\"),\"\")),C1=\"Hex\",(IF(INT(RIGHT(CONCATENATE(IF($C$2<10,CONCATENATE(\"0\",$C$2),$C$2),\".\",\"026\"),3))<($C$3+1),CONCATENATE(DEC2HEX($C$2),\".\",\"026\"),\"\")))","v":""},"","",null,{"$f":"IFERROR(VLOOKUP(D31,Lists!C:D,2,FALSE),\"\")","v":""},{"$f":"IFERROR(VLOOKUP(D31,Lists!C:E,3,FALSE),\"\")","v":""}]
[{"$f":"_xlfn.IFS(C1=\"Decimal\",(IF(INT(RIGHT(CONCATENATE(IF($C$2<10,CONCATENATE(\"0\",$C$2),$C$2),\".\",\"027\"),3))<($C$3+1),CONCATENATE(IF($C$2<10,CONCATENATE(\"0\",$C$2),$C$2),\".\",\"027\"),\"\")),C1=\"Hex\",(IF(INT(RIGHT(CONCATENATE(IF($C$2<10,CONCATENATE(\"0\",$C$2),$C$2),\".\",\"027\"),3))<($C$3+1),CONCATENATE(DEC2HEX($C$2),\".\",\"027\"),\"\")))","v":""},"","",null,{"$f":"IFERROR(VLOOKUP(D32,Lists!C:D,2,FALSE),\"\")","v":""},{"$f":"IFERROR(VLOOKUP(D32,Lists!C:E,3,FALSE),\"\")","v":""}]
[{"$f":"_xlfn.IFS(C1=\"Decimal\",(IF(INT(RIGHT(CONCATENATE(IF($C$2<10,CONCATENATE(\"0\",$C$2),$C$2),\".\",\"028\"),3))<($C$3+1),CONCATENATE(IF($C$2<10,CONCATENATE(\"0\",$C$2),$C$2),\".\",\"028\"),\"\")),C1=\"Hex\",(IF(INT(RIGHT(CONCATENATE(IF($C$2<10,CONCATENATE(\"0\",$C$2),$C$2),\".\",\"028\"),3))<($C$3+1),CONCATENATE(DEC2HEX($C$2),\".\",\"028\"),\"\")))","v":""},"","",null,{"$f":"IFERROR(VLOOKUP(D33,Lists!C:D,2,FALSE),\"\")","v":""},{"$f":"IFERROR(VLOOKUP(D33,Lists!C:E,3,FALSE),\"\")","v":""}]
[{"$f":"_xlfn.IFS(C1=\"Decimal\",(IF(INT(RIGHT(CONCATENATE(IF($C$2<10,CONCATENATE(\"0\",$C$2),$C$2),\".\",\"029\"),3))<($C$3+1),CONCATENATE(IF($C$2<10,CONCATENATE(\"0\",$C$2),$C$2),\".\",\"029\"),\"\")),C1=\"Hex\",(IF(INT(RIGHT(CONCATENATE(IF($C$2<10,CONCATENATE(\"0\",$C$2),$C$2),\".\",\"029\"),3))<($C$3+1),CONCATENATE(DEC2HEX($C$2),\".\",\"029\"),\"\")))","v":""},"","",null,{"$f":"IFERROR(VLOOKUP(D34,Lists!C:D,2,FALSE),\"\")","v":""},{"$f":"IFERROR(VLOOKUP(D34,Lists!C:E,3,FALSE),\"\")","v":""}]
[{"$f":"_xlfn.IFS(C1=\"Decimal\",(IF(INT(RIGHT(CONCATENATE(IF($C$2<10,CONCATENATE(\"0\",$C$2),$C$2),\".\",\"030\"),3))<($C$3+1),CONCATENATE(IF($C$2<10,CONCATENATE(\"0\",$C$2),$C$2),\".\",\"030\"),\"\")),C1=\"Hex\",(IF(INT(RIGHT(CONCATENATE(IF($C$2<10,CONCATENATE(\"0\",$C$2),$C$2),\".\",\"030\"),3))<($C$3+1),CONCATENATE(DEC2HEX($C$2),\".\",\"030\"),\"\")))","v":""},"","",null,{"$f":"IFERROR(VLOOKUP(D35,Lists!C:D,2,FALSE),\"\")","v":""},{"$f":"IFERROR(VLOOKUP(D35,Lists!C:E,3,FALSE),\"\")","v":""}]
[{"$f":"_xlfn.IFS(C1=\"Decimal\",(IF(INT(RIGHT(CONCATENATE(IF($C$2<10,CONCATENATE(\"0\",$C$2),$C$2),\".\",\"031\"),3))<($C$3+1),CONCATENATE(IF($C$2<10,CONCATENATE(\"0\",$C$2),$C$2),\".\",\"031\"),\"\")),C1=\"Hex\",(IF(INT(RIGHT(CONCATENATE(IF($C$2<10,CONCATENATE(\"0\",$C$2),$C$2),\".\",\"031\"),3))<($C$3+1),CONCATENATE(DEC2HEX($C$2),\".\",\"031\"),\"\")))","v":""},"","",null,{"$f":"IFERROR(VLOOKUP(D36,Lists!C:D,2,FALSE),\"\")","v":""},{"$f":"IFERROR(VLOOKUP(D36,Lists!C:E,3,FALSE),\"\")","v":""}]
[{"$f":"_xlfn.IFS(C1=\"Decimal\",(IF(INT(RIGHT(CONCATENATE(IF($C$2<10,CONCATENATE(\"0\",$C$2),$C$2),\".\",\"032\"),3))<($C$3+1),CONCATENATE(IF($C$2<10,CONCATENATE(\"0\",$C$2),$C$2),\".\",\"032\"),\"\")),C1=\"Hex\",(IF(INT(RIGHT(CONCATENATE(IF($C$2<10,CONCATENATE(\"0\",$C$2),$C$2),\".\",\"032\"),3))<($C$3+1),CONCATENATE(DEC2HEX($C$2),\".\",\"032\"),\"\")))","v":""},"","",null,{"$f":"IFERROR(VLOOKUP(D37,Lists!C:D,2,FALSE),\"\")","v":""},{"$f":"IFERROR(VLOOKUP(D37,Lists!C:E,3,FALSE),\"\")","v":""}]
[{"$f":"_xlfn.IFS(C1=\"Decimal\",(IF(INT(RIGHT(CONCATENATE(IF($C$2<10,CONCATENATE(\"0\",$C$2),$C$2),\".\",\"033\"),3))<($C$3+1),CONCATENATE(IF($C$2<10,CONCATENATE(\"0\",$C$2),$C$2),\".\",\"033\"),\"\")),C1=\"Hex\",(IF(INT(RIGHT(CONCATENATE(IF($C$2<10,CONCATENATE(\"0\",$C$2),$C$2),\".\",\"033\"),3))<($C$3+1),CONCATENATE(DEC2HEX($C$2),\".\",\"033\"),\"\")))","v":""},"","",null,{"$f":"IFERROR(VLOOKUP(D38,Lists!C:D,2,FALSE),\"\")","v":""},{"$f":"IFERROR(VLOOKUP(D38,Lists!C:E,3,FALSE),\"\")","v":""}]
[{"$f":"_xlfn.IFS(C1=\"Decimal\",(IF(INT(RIGHT(CONCATENATE(IF($C$2<10,CONCATENATE(\"0\",$C$2),$C$2),\".\",\"034\"),3))<($C$3+1),CONCATENATE(IF($C$2<10,CONCATENATE(\"0\",$C$2),$C$2),\".\",\"034\"),\"\")),C1=\"Hex\",(IF(INT(RIGHT(CONCATENATE(IF($C$2<10,CONCATENATE(\"0\",$C$2),$C$2),\".\",\"034\"),3))<($C$3+1),CONCATENATE(DEC2HEX($C$2),\".\",\"034\"),\"\")))","v":""},"","",null,{"$f":"IFERROR(VLOOKUP(D39,Lists!C:D,2,FALSE),\"\")","v":""},{"$f":"IFERROR(VLOOKUP(D39,Lists!C:E,3,FALSE),\"\")","v":""}]
[{"$f":"_xlfn.IFS(C1=\"Decimal\",(IF(INT(RIGHT(CONCATENATE(IF($C$2<10,CONCATENATE(\"0\",$C$2),$C$2),\".\",\"035\"),3))<($C$3+1),CONCATENATE(IF($C$2<10,CONCATENATE(\"0\",$C$2),$C$2),\".\",\"035\"),\"\")),C1=\"Hex\",(IF(INT(RIGHT(CONCATENATE(IF($C$2<10,CONCATENATE(\"0\",$C$2),$C$2),\".\",\"035\"),3))<($C$3+1),CONCATENATE(DEC2HEX($C$2),\".\",\"035\"),\"\")))","v":""},"","",null,{"$f":"IFERROR(VLOOKUP(D40,Lists!C:D,2,FALSE),\"\")","v":""},{"$f":"IFERROR(VLOOKUP(D40,Lists!C:E,3,FALSE),\"\")","v":""}]
{"$rows_left_out":93}